BDBM50393808 CHEMBL2159542
SMILES: [O-][N+](=O)c1ccc(C2=NO[C@H]3CCCCC[C@@H]23)c(c1)C(F)(F)F
InChI Key: InChIKey=YLOOXUHFJVFILH-YPMHNXCESA-N
Data: 1 IC50
Activity Spreadsheet -- Enzyme Inhibition Constant Data from BindingDB
Found 1 hit for monomerid = 50393808
Trg + Lig
Ki
nM
ΔG°
kcal/mole
IC50
nM
Kd
nM
EC50/IC50
nM
koff
s-1
kon
M-1s-1
pHTemp
°C
Androgen Receptor
(Homo sapiens (Human))
BDBM50393808
(CHEMBL2159542)
Show SMILES [O-][N+](=O)c1ccc(C2=NO[C@H]3CCCCC[C@@H]23)c(c1)C(F)(F)F |r,t:7|
Show InChI InChI=1S/C15H15F3N2O3/c16-15(17,18)12-8-9(20(21)22)6-7-10(12)14-11-4-2-1-3-5-13(11)23-19-14/h6-8,11,13H,1-5H2/t11-,13+/m1/s1
NCI pathway
Reactome pathway
n/an/a 389n/an/an/an/an/an/a
University of Eastern Finland
Curated by ChEMBL
Assay Description
Displacement of [3H]R1881 from wild type human androgen receptor expressed in COS-1 cells co-transfected with pSG5 after 15 mins by scintillation ass...
J Med Chem 55: 6316-27 (2012)
Article DOI: 10.1021/jm300233k
BindingDB Entry DOI: 10.7270/Q2NS0W1N