BDBM50394119 CHEMBL2158781
SMILES: Cc1cc(F)ccc1OC1CCN(CC2CCN(CC2)[C@@H](Cc2ccc(F)cc2)C(O)=O)CC1
InChI Key: InChIKey=CWXOTCCLEKNUJY-VWLOTQADSA-N
Data: 2 KI  1 IC50
Activity Spreadsheet -- Enzyme Inhibition Constant Data from BindingDB
Found 3 hits for monomerid = 50394119
Trg + Lig
Ki
nM
ΔG°
kcal/mole
IC50
nM
Kd
nM
EC50/IC50
nM
koff
s-1
kon
M-1s-1
pHTemp
°C
C-C chemokine receptor type 3
(Homo sapiens (Human))
BDBM50394119
(CHEMBL2158781)
Show SMILES Cc1cc(F)ccc1OC1CCN(CC2CCN(CC2)[C@@H](Cc2ccc(F)cc2)C(O)=O)CC1 |r|
Show InChI InChI=1S/C27H34F2N2O3/c1-19-16-23(29)6-7-26(19)34-24-10-12-30(13-11-24)18-21-8-14-31(15-9-21)25(27(32)33)17-20-2-4-22(28)5-3-20/h2-7,16,21,24-25H,8-15,17-18H2,1H3,(H,32,33)/t25-/m0/s1
Reactome pathway
12.6n/an/an/an/an/an/an/an/a
AstraZeneca
Curated by ChEMBL
Assay Description
Binding affinity to human CCR3 expressed in CHOK1 cells by radioligand displacement assay
Bioorg Med Chem Lett 22: 6694-9 (2012)
Article DOI: 10.1016/j.bmcl.2012.08.103
BindingDB Entry DOI: 10.7270/Q2Z320SD
Histamine H1 receptor
(Homo sapiens (Human))
BDBM50394119
(CHEMBL2158781)
Show SMILES Cc1cc(F)ccc1OC1CCN(CC2CCN(CC2)[C@@H](Cc2ccc(F)cc2)C(O)=O)CC1 |r|
Show InChI InChI=1S/C27H34F2N2O3/c1-19-16-23(29)6-7-26(19)34-24-10-12-30(13-11-24)18-21-8-14-31(15-9-21)25(27(32)33)17-20-2-4-22(28)5-3-20/h2-7,16,21,24-25H,8-15,17-18H2,1H3,(H,32,33)/t25-/m0/s1
Reactome pathway
158n/an/an/an/an/an/an/an/a
AstraZeneca
Curated by ChEMBL
Assay Description
Binding affinity to histamine H1 receptor
Bioorg Med Chem Lett 22: 6694-9 (2012)
Article DOI: 10.1016/j.bmcl.2012.08.103
BindingDB Entry DOI: 10.7270/Q2Z320SD
Potassium voltage-gated channel subfamily H member 2
(Homo sapiens (Human))
BDBM50394119
(CHEMBL2158781)
Show SMILES Cc1cc(F)ccc1OC1CCN(CC2CCN(CC2)[C@@H](Cc2ccc(F)cc2)C(O)=O)CC1 |r|
Show InChI InChI=1S/C27H34F2N2O3/c1-19-16-23(29)6-7-26(19)34-24-10-12-30(13-11-24)18-21-8-14-31(15-9-21)25(27(32)33)17-20-2-4-22(28)5-3-20/h2-7,16,21,24-25H,8-15,17-18H2,1H3,(H,32,33)/t25-/m0/s1
Reactome pathway
n/an/a>1.00E+5n/an/an/an/an/an/a
AstraZeneca
Curated by ChEMBL
Assay Description
Displacement of 3,7-Bis[2-(4-nitro[3,5-3H]phenyl)ethyl]-3,7-diazabicyclo[3.3.1]nonane from human ERG expressed in HEK cells after 3 hrs by TopCount a...
Bioorg Med Chem Lett 22: 6694-9 (2012)
Article DOI: 10.1016/j.bmcl.2012.08.103
BindingDB Entry DOI: 10.7270/Q2Z320SD