BDBM50394127 CHEMBL2158773
SMILES: Cc1cccc(C[C@H](N2CCC(CN3CCC(CC3)Oc3ccc(Cl)c(Cl)c3)CC2)C(O)=O)c1
InChI Key: InChIKey=CGPUMTTUBWGRHT-SANMLTNESA-N
Data: 2 KI  1 IC50
Activity Spreadsheet -- Enzyme Inhibition Constant Data from BindingDB
Found 3 hits for monomerid = 50394127
Trg + Lig
Ki
nM
ΔG°
kcal/mole
IC50
nM
Kd
nM
EC50/IC50
nM
koff
s-1
kon
M-1s-1
pHTemp
°C
Histamine H1 receptor
(Homo sapiens (Human))
BDBM50394127
(CHEMBL2158773)
Show SMILES Cc1cccc(C[C@H](N2CCC(CN3CCC(CC3)Oc3ccc(Cl)c(Cl)c3)CC2)C(O)=O)c1 |r|
Show InChI InChI=1S/C27H34Cl2N2O3/c1-19-3-2-4-21(15-19)16-26(27(32)33)31-13-7-20(8-14-31)18-30-11-9-22(10-12-30)34-23-5-6-24(28)25(29)17-23/h2-6,15,17,20,22,26H,7-14,16,18H2,1H3,(H,32,33)/t26-/m0/s1
Reactome pathway
15.8n/an/an/an/an/an/an/an/a
AstraZeneca
Curated by ChEMBL
Assay Description
Binding affinity to histamine H1 receptor
Bioorg Med Chem Lett 22: 6694-9 (2012)
Article DOI: 10.1016/j.bmcl.2012.08.103
BindingDB Entry DOI: 10.7270/Q2Z320SD
C-C chemokine receptor type 3
(Homo sapiens (Human))
BDBM50394127
(CHEMBL2158773)
Show SMILES Cc1cccc(C[C@H](N2CCC(CN3CCC(CC3)Oc3ccc(Cl)c(Cl)c3)CC2)C(O)=O)c1 |r|
Show InChI InChI=1S/C27H34Cl2N2O3/c1-19-3-2-4-21(15-19)16-26(27(32)33)31-13-7-20(8-14-31)18-30-11-9-22(10-12-30)34-23-5-6-24(28)25(29)17-23/h2-6,15,17,20,22,26H,7-14,16,18H2,1H3,(H,32,33)/t26-/m0/s1
Reactome pathway
19.9n/an/an/an/an/an/an/an/a
AstraZeneca
Curated by ChEMBL
Assay Description
Binding affinity to human CCR3 expressed in CHOK1 cells by radioligand displacement assay
Bioorg Med Chem Lett 22: 6694-9 (2012)
Article DOI: 10.1016/j.bmcl.2012.08.103
BindingDB Entry DOI: 10.7270/Q2Z320SD
Potassium voltage-gated channel subfamily H member 2
(Homo sapiens (Human))
BDBM50394127
(CHEMBL2158773)
Show SMILES Cc1cccc(C[C@H](N2CCC(CN3CCC(CC3)Oc3ccc(Cl)c(Cl)c3)CC2)C(O)=O)c1 |r|
Show InChI InChI=1S/C27H34Cl2N2O3/c1-19-3-2-4-21(15-19)16-26(27(32)33)31-13-7-20(8-14-31)18-30-11-9-22(10-12-30)34-23-5-6-24(28)25(29)17-23/h2-6,15,17,20,22,26H,7-14,16,18H2,1H3,(H,32,33)/t26-/m0/s1
Reactome pathway
n/an/a 6.31E+3n/an/an/an/an/an/a
AstraZeneca
Curated by ChEMBL
Assay Description
Displacement of 3,7-Bis[2-(4-nitro[3,5-3H]phenyl)ethyl]-3,7-diazabicyclo[3.3.1]nonane from human ERG expressed in HEK cells after 3 hrs by TopCount a...
Bioorg Med Chem Lett 22: 6694-9 (2012)
Article DOI: 10.1016/j.bmcl.2012.08.103
BindingDB Entry DOI: 10.7270/Q2Z320SD