BDBM50394404 CHEMBL2160073
SMILES: Clc1ccc(Nc2nccc3cc(ccc23)N2CCS(=O)(=O)CC2)cc1-c1nc(c[nH]1)-c1ccccc1
InChI Key: InChIKey=UOIMGERGVYFCHZ-UHFFFAOYSA-N
Data: 2 IC50
Activity Spreadsheet -- Enzyme Inhibition Constant Data from BindingDB
Found 2 hits for monomerid = 50394404
Trg + Lig
Ki
nM
ΔG°
kcal/mole
IC50
nM
Kd
nM
EC50/IC50
nM
koff
s-1
kon
M-1s-1
pHTemp
°C
Smoothened homolog
(Mus musculus)
BDBM50394404
(CHEMBL2160073)
Show SMILES Clc1ccc(Nc2nccc3cc(ccc23)N2CCS(=O)(=O)CC2)cc1-c1nc(c[nH]1)-c1ccccc1
Show InChI InChI=1S/C28H24ClN5O2S/c29-25-9-6-21(17-24(25)28-31-18-26(33-28)19-4-2-1-3-5-19)32-27-23-8-7-22(16-20(23)10-11-30-27)34-12-14-37(35,36)15-13-34/h1-11,16-18H,12-15H2,(H,30,32)(H,31,33)
n/an/a 2n/an/an/an/an/an/a
Genomics Institute of the Novartis Research Foundation
Curated by ChEMBL
Assay Description
Antagonist activity at Smo in mouse TM3 cells expressing Hh12 assessed as inhibition of 1 nM Ag1.5-induced Gli expression incubated for 30 mins prior...
Bioorg Med Chem Lett 22: 6573-6 (2012)
Article DOI: 10.1016/j.bmcl.2012.09.013
BindingDB Entry DOI: 10.7270/Q2RB75PK
Smoothened homolog
(Mus musculus)
BDBM50394404
(CHEMBL2160073)
Show SMILES Clc1ccc(Nc2nccc3cc(ccc23)N2CCS(=O)(=O)CC2)cc1-c1nc(c[nH]1)-c1ccccc1
Show InChI InChI=1S/C28H24ClN5O2S/c29-25-9-6-21(17-24(25)28-31-18-26(33-28)19-4-2-1-3-5-19)32-27-23-8-7-22(16-20(23)10-11-30-27)34-12-14-37(35,36)15-13-34/h1-11,16-18H,12-15H2,(H,30,32)(H,31,33)
n/an/a 31n/an/an/an/an/an/a
Genomics Institute of the Novartis Research Foundation
Curated by ChEMBL
Assay Description
Antagonist activity at Smo in mouse TM3 cells expressing Hh12 assessed as inhibition of 25 nM Ag1.5-induced Gli expression incubated for 30 mins prio...
Bioorg Med Chem Lett 22: 6573-6 (2012)
Article DOI: 10.1016/j.bmcl.2012.09.013
BindingDB Entry DOI: 10.7270/Q2RB75PK