null
SMILES: CCN(CC)c1ccc(C#N)c2nc(c(C)cc12)-c1c(OC)cc(COC)cc1OC
InChI Key: InChIKey=YJUKMZOXZHNYIB-UHFFFAOYSA-N
Activity Spreadsheet -- Enzyme Inhibition Constant Data from BindingDB
Found 2 hits for monomerid = 50394525
Trg + Lig
Ki
nM
ΔG°
kcal/mole
IC50
nM
Kd
nM
EC50/IC50
nM
koff
s-1
kon
M-1s-1
pHTemp
°C
Corticotropin-releasing factor receptor 1
(Homo sapiens (Human))
BDBM50394525
(CHEMBL2160164)
Show SMILES CCN(CC)c1ccc(C#N)c2nc(c(C)cc12)-c1c(OC)cc(COC)cc1OC |(4.59,5.83,;3.28,5.03,;1.94,5.78,;1.92,7.32,;3.25,8.11,;.61,5,;-.73,5.75,;-2.05,4.97,;-2.04,3.43,;-3.36,2.65,;-4.69,1.86,;-.7,2.67,;-.68,1.13,;.66,.38,;1.99,1.16,;3.33,.41,;1.97,2.7,;.63,3.46,;.68,-1.16,;-.65,-1.95,;-1.99,-1.19,;-3.31,-1.97,;-.63,-3.49,;.71,-4.24,;.73,-5.78,;-.6,-6.57,;-.58,-8.11,;2.04,-3.46,;2.02,-1.92,;3.35,-1.13,;4.69,-1.89,)|
Show InChI InChI=1S/C25H29N3O3/c1-7-28(8-2)20-10-9-18(14-26)25-19(20)11-16(3)24(27-25)23-21(30-5)12-17(15-29-4)13-22(23)31-6/h9-13H,7-8,15H2,1-6H3
Reactome pathway
n/an/a 102n/an/an/an/an/an/a
Eisai Co., Ltd
Curated by ChEMBL
Assay Description
Displacement of [125I]-CRF from human CRF1 receptor expressed in HEK293 cells after 2 hrs by scintillation counting
Bioorg Med Chem 20: 6559-78 (2012)
Article DOI: 10.1016/j.bmc.2012.09.028
BindingDB Entry DOI: 10.7270/Q2B56KVZ
Corticotropin-releasing factor receptor 1
(Homo sapiens (Human))
BDBM50394525
(CHEMBL2160164)
Show SMILES CCN(CC)c1ccc(C#N)c2nc(c(C)cc12)-c1c(OC)cc(COC)cc1OC |(4.59,5.83,;3.28,5.03,;1.94,5.78,;1.92,7.32,;3.25,8.11,;.61,5,;-.73,5.75,;-2.05,4.97,;-2.04,3.43,;-3.36,2.65,;-4.69,1.86,;-.7,2.67,;-.68,1.13,;.66,.38,;1.99,1.16,;3.33,.41,;1.97,2.7,;.63,3.46,;.68,-1.16,;-.65,-1.95,;-1.99,-1.19,;-3.31,-1.97,;-.63,-3.49,;.71,-4.24,;.73,-5.78,;-.6,-6.57,;-.58,-8.11,;2.04,-3.46,;2.02,-1.92,;3.35,-1.13,;4.69,-1.89,)|
Show InChI InChI=1S/C25H29N3O3/c1-7-28(8-2)20-10-9-18(14-26)25-19(20)11-16(3)24(27-25)23-21(30-5)12-17(15-29-4)13-22(23)31-6/h9-13H,7-8,15H2,1-6H3
Reactome pathway
n/an/a 36n/an/an/an/an/an/a
Eisai Co., Ltd
Curated by ChEMBL
Assay Description
Antagonist activity at human CRF1 receptor expressed in HEK293 cells assessed as inhibition of CRF-induced intracellular cAMP production preincubated...
Bioorg Med Chem 20: 6559-78 (2012)
Article DOI: 10.1016/j.bmc.2012.09.028
BindingDB Entry DOI: 10.7270/Q2B56KVZ