null
SMILES: CN(CCCCCCCOc1cccc(c1)-c1oc2ccccc2c1C(=O)c1ccc(C)cc1)Cc1ccccc1
InChI Key: InChIKey=NUGRWCOCRSLONK-UHFFFAOYSA-N
Activity Spreadsheet -- Enzyme Inhibition Constant Data from BindingDB
Found 1 hit for monomerid = 50394583
Trg + Lig
Ki
nM
ΔG°
kcal/mole
IC50
nM
Kd
nM
EC50/IC50
nM
koff
s-1
kon
M-1s-1
pHTemp
°C
Cholinesterase
(Homo sapiens (Human))
BDBM50394583
(CHEMBL2160229)
Show SMILES CN(CCCCCCCOc1cccc(c1)-c1oc2ccccc2c1C(=O)c1ccc(C)cc1)Cc1ccccc1
Show InChI InChI=1S/C37H39NO3/c1-28-20-22-30(23-21-28)36(39)35-33-18-9-10-19-34(33)41-37(35)31-16-13-17-32(26-31)40-25-12-5-3-4-11-24-38(2)27-29-14-7-6-8-15-29/h6-10,13-23,26H,3-5,11-12,24-25,27H2,1-2H3
Reactome pathway
n/an/a 4.39E+4n/an/an/an/an/an/a
University of Bologna
Curated by ChEMBL
Assay Description
Inhibition of human serum BuChE using butyrylthiocholine iodide as substrate preincubated for 20 mins prior to substrate addition by Ellman's method
Eur J Med Chem 58: 519-32 (2012)
Article DOI: 10.1016/j.ejmech.2012.10.045
BindingDB Entry DOI: 10.7270/Q2XW4KW5