BDBM50394704 CHEMBL2165644
SMILES: NC(NC(=O)CCCCCCCCCCCCCCCCCCCCC(=O)NC(=N)NCCCc1cnc[nH]1)=NCCCc1cnc[nH]1
InChI Key: InChIKey=DRBIFKPSERWRDO-UHFFFAOYSA-N
Data: 3 EC50
Activity Spreadsheet -- Enzyme Inhibition Constant Data from BindingDB
Found 3 hits for monomerid = 50394704
Trg + Lig
Ki
nM
ΔG°
kcal/mole
IC50
nM
Kd
nM
EC50/IC50
nM
koff
s-1
kon
M-1s-1
pHTemp
°C
Histamine H4 receptor
(Homo sapiens (Human))
BDBM50394704
(CHEMBL2165644)
Show SMILES NC(NC(=O)CCCCCCCCCCCCCCCCCCCCC(=O)NC(=N)NCCCc1cnc[nH]1)=NCCCc1cnc[nH]1 |w:39.40|
Show InChI InChI=1S/C36H64N10O2/c37-35(41-25-19-21-31-27-39-29-43-31)45-33(47)23-17-15-13-11-9-7-5-3-1-2-4-6-8-10-12-14-16-18-24-34(48)46-36(38)42-26-20-22-32-28-40-30-44-32/h27-30H,1-26H2,(H,39,43)(H,40,44)(H3,37,41,45,47)(H3,38,42,46,48)
Reactome pathway
n/an/an/an/a>1.00E+3n/an/an/an/a
University of Regensburg
Curated by ChEMBL
Assay Description
Agonist activity at human H4R-RGS19 Galphai2 Gbeta1gamma2 expressed in Sf9 cells at 0.1 nM to 1 mM by steady state GTPase activity assay
J Med Chem 55: 1147-60 (2012)
Article DOI: 10.1021/jm201128q
BindingDB Entry DOI: 10.7270/Q2HQ411W
Histamine H2 receptor
(Cavia porcellus (domestic guinea pig))
BDBM50394704
(CHEMBL2165644)
Show SMILES NC(NC(=O)CCCCCCCCCCCCCCCCCCCCC(=O)NC(=N)NCCCc1cnc[nH]1)=NCCCc1cnc[nH]1 |w:39.40|
Show InChI InChI=1S/C36H64N10O2/c37-35(41-25-19-21-31-27-39-29-43-31)45-33(47)23-17-15-13-11-9-7-5-3-1-2-4-6-8-10-12-14-16-18-24-34(48)46-36(38)42-26-20-22-32-28-40-30-44-32/h27-30H,1-26H2,(H,39,43)(H,40,44)(H3,37,41,45,47)(H3,38,42,46,48)
n/an/an/an/a 34.7n/an/an/an/a
University of Regensburg
Curated by ChEMBL
Assay Description
Agonist activity at guinea pig H2R-Gsalphas expressed in Sf9 cells at 0.1 nM to 10 uM by steady state GTPase activity assay
J Med Chem 55: 1147-60 (2012)
Article DOI: 10.1021/jm201128q
BindingDB Entry DOI: 10.7270/Q2HQ411W
Histamine H3 receptor
(Homo sapiens (Human))
BDBM50394704
(CHEMBL2165644)
Show SMILES NC(NC(=O)CCCCCCCCCCCCCCCCCCCCC(=O)NC(=N)NCCCc1cnc[nH]1)=NCCCc1cnc[nH]1 |w:39.40|
Show InChI InChI=1S/C36H64N10O2/c37-35(41-25-19-21-31-27-39-29-43-31)45-33(47)23-17-15-13-11-9-7-5-3-1-2-4-6-8-10-12-14-16-18-24-34(48)46-36(38)42-26-20-22-32-28-40-30-44-32/h27-30H,1-26H2,(H,39,43)(H,40,44)(H3,37,41,45,47)(H3,38,42,46,48)
Reactome pathway
n/an/an/an/a 447n/an/an/an/a
University of Regensburg
Curated by ChEMBL
Assay Description
Agonist activity at human H3R-Galphai2-Gbeta1gamma2-RGS4 expressed in Sf9 cells 0.1 nM to 1 mM by steady state GTPase activity assay
J Med Chem 55: 1147-60 (2012)
Article DOI: 10.1021/jm201128q
BindingDB Entry DOI: 10.7270/Q2HQ411W