BDBM50394853 CHEMBL2165010::US8772480, 44
SMILES: COc1ccc(Nc2ncc(CN3CCOCC3)cc2-c2nc(C)nc(N)n2)cn1
InChI Key: InChIKey=OIPZJHZMJMKKBK-UHFFFAOYSA-N
Data: 5 KI  2 IC50
Activity Spreadsheet -- Enzyme Inhibition Constant Data from BindingDB
Found 7 hits for monomerid = 50394853
Trg + Lig
Ki
nM
ΔG°
kcal/mole
IC50
nM
Kd
nM
EC50/IC50
nM
koff
s-1
kon
M-1s-1
pHTemp
°C
Phosphatidylinositol 4,5-bisphosphate 3-kinase catalytic subunit beta isoform
(Homo sapiens (Human))
BDBM50394853
(CHEMBL2165010 | US8772480, 44)
Show SMILES COc1ccc(Nc2ncc(CN3CCOCC3)cc2-c2nc(C)nc(N)n2)cn1
Show InChI InChI=1S/C20H24N8O2/c1-13-24-19(27-20(21)25-13)16-9-14(12-28-5-7-30-8-6-28)10-23-18(16)26-15-3-4-17(29-2)22-11-15/h3-4,9-11H,5-8,12H2,1-2H3,(H,23,26)(H2,21,24,25,27)
NCI pathway
Reactome pathway
7n/an/an/an/an/an/an/an/a
Amgen Inc.
Curated by ChEMBL
Assay Description
Inhibition of human N-terminal poly-His tagged-PI3Kbeta expressed in Sf9 baculovirus system co-expressing p85alpha after 20 mins by AlphaScreen assay
J Med Chem 55: 5188-219 (2012)
Article DOI: 10.1021/jm300184s
BindingDB Entry DOI: 10.7270/Q23F4QSJ
Phosphatidylinositol 4,5-bisphosphate 3-kinase catalytic subunit gamma isoform
(Homo sapiens (Human))
BDBM50394853
(CHEMBL2165010 | US8772480, 44)
Show SMILES COc1ccc(Nc2ncc(CN3CCOCC3)cc2-c2nc(C)nc(N)n2)cn1
Show InChI InChI=1S/C20H24N8O2/c1-13-24-19(27-20(21)25-13)16-9-14(12-28-5-7-30-8-6-28)10-23-18(16)26-15-3-4-17(29-2)22-11-15/h3-4,9-11H,5-8,12H2,1-2H3,(H,23,26)(H2,21,24,25,27)
NCI pathway
Reactome pathway
17n/an/an/an/an/an/an/an/a
Amgen Inc.
Curated by ChEMBL
Assay Description
Inhibition of human N-terminal poly-His tagged-PI3Kgamma expressed in Sf9 baculovirus system co-expressing p85alpha after 20 mins by AlphaScreen assa...
J Med Chem 55: 5188-219 (2012)
Article DOI: 10.1021/jm300184s
BindingDB Entry DOI: 10.7270/Q23F4QSJ
Phosphatidylinositol 4,5-bisphosphate 3-kinase catalytic subunit delta isoform
(Homo sapiens (Human))
BDBM50394853
(CHEMBL2165010 | US8772480, 44)
Show SMILES COc1ccc(Nc2ncc(CN3CCOCC3)cc2-c2nc(C)nc(N)n2)cn1
Show InChI InChI=1S/C20H24N8O2/c1-13-24-19(27-20(21)25-13)16-9-14(12-28-5-7-30-8-6-28)10-23-18(16)26-15-3-4-17(29-2)22-11-15/h3-4,9-11H,5-8,12H2,1-2H3,(H,23,26)(H2,21,24,25,27)
NCI pathway
Reactome pathway
18n/an/an/an/an/an/an/an/a
Amgen Inc.
Curated by ChEMBL
Assay Description
Inhibition of human N-terminal poly-His tagged-PI3Kdelta expressed in Sf9 baculovirus system co-expressing p85alpha after 20 mins by AlphaScreen assa...
J Med Chem 55: 5188-219 (2012)
Article DOI: 10.1021/jm300184s
BindingDB Entry DOI: 10.7270/Q23F4QSJ
Phosphatidylinositol 4,5-bisphosphate 3-kinase catalytic subunit alpha isoform
(Homo sapiens (Human))
BDBM50394853
(CHEMBL2165010 | US8772480, 44)
Show SMILES COc1ccc(Nc2ncc(CN3CCOCC3)cc2-c2nc(C)nc(N)n2)cn1
Show InChI InChI=1S/C20H24N8O2/c1-13-24-19(27-20(21)25-13)16-9-14(12-28-5-7-30-8-6-28)10-23-18(16)26-15-3-4-17(29-2)22-11-15/h3-4,9-11H,5-8,12H2,1-2H3,(H,23,26)(H2,21,24,25,27)
NCI pathway
Reactome pathway
100n/an/an/an/an/an/an/an/a
Amgen Inc.
Curated by ChEMBL
Assay Description
Inhibition of human N-terminal poly-His tagged-PI3Kalpha expressed in Sf9 baculovirus system co-expressing p85alpha after 20 mins by AlphaScreen assa...
J Med Chem 55: 5188-219 (2012)
Article DOI: 10.1021/jm300184s
BindingDB Entry DOI: 10.7270/Q23F4QSJ
Phosphatidylinositol 4,5-bisphosphate 3-kinase catalytic subunit alpha isoform
(Homo sapiens (Human))
BDBM50394853
(CHEMBL2165010 | US8772480, 44)
Show SMILES COc1ccc(Nc2ncc(CN3CCOCC3)cc2-c2nc(C)nc(N)n2)cn1
Show InChI InChI=1S/C20H24N8O2/c1-13-24-19(27-20(21)25-13)16-9-14(12-28-5-7-30-8-6-28)10-23-18(16)26-15-3-4-17(29-2)22-11-15/h3-4,9-11H,5-8,12H2,1-2H3,(H,23,26)(H2,21,24,25,27)
NCI pathway
Reactome pathway
US Patent
104n/an/an/an/an/an/an/an/a
Amgen Inc.
US Patent
Assay Description
The PI3K AlphaScreen assay (PerkinElmer, Waltham, Mass.) measures the activity of a panel of four phosphoinositide 3-kinases: PI3Kalpha, PI3Kbeta, PI...
US Patent US8772480 (2014)
BindingDB Entry DOI: 10.7270/Q2V123FJ
Serine/threonine-protein kinase mTOR
(Homo sapiens (Human))
BDBM50394853
(CHEMBL2165010 | US8772480, 44)
Show SMILES COc1ccc(Nc2ncc(CN3CCOCC3)cc2-c2nc(C)nc(N)n2)cn1
Show InChI InChI=1S/C20H24N8O2/c1-13-24-19(27-20(21)25-13)16-9-14(12-28-5-7-30-8-6-28)10-23-18(16)26-15-3-4-17(29-2)22-11-15/h3-4,9-11H,5-8,12H2,1-2H3,(H,23,26)(H2,21,24,25,27)
NCI pathway
Reactome pathway
US Patent
n/an/a>1.00E+4n/an/an/an/an/an/a
Amgen Inc.
US Patent
Assay Description
The Invitrogen (Carlsbad, Calif.) mammalian target of rapamycin (mTOR) Lanthascreen assay can be used to quantitate mTOR kinase activity in an in vit...
US Patent US8772480 (2014)
BindingDB Entry DOI: 10.7270/Q2V123FJ
Serine/threonine-protein kinase mTOR
(Homo sapiens (Human))
BDBM50394853
(CHEMBL2165010 | US8772480, 44)
Show SMILES COc1ccc(Nc2ncc(CN3CCOCC3)cc2-c2nc(C)nc(N)n2)cn1
Show InChI InChI=1S/C20H24N8O2/c1-13-24-19(27-20(21)25-13)16-9-14(12-28-5-7-30-8-6-28)10-23-18(16)26-15-3-4-17(29-2)22-11-15/h3-4,9-11H,5-8,12H2,1-2H3,(H,23,26)(H2,21,24,25,27)
NCI pathway
Reactome pathway
n/an/a>1.00E+4n/an/an/an/an/an/a
Amgen Inc.
Curated by ChEMBL
Assay Description
Inhibition of recombinant GST-tagged mTOR-mediated 4EBP1 phosphorylation after 90 mins by FRET assay
J Med Chem 55: 5188-219 (2012)
Article DOI: 10.1021/jm300184s
BindingDB Entry DOI: 10.7270/Q23F4QSJ