BDBM50394977 CHEMBL583068
SMILES: [#7]\[#6](-[#7])=[#7]\[#7]=[#6]-c1ccc(Cl)c(c1)C(F)(F)F
InChI Key: InChIKey=SYKKEBRXRXCNEC-UHFFFAOYSA-N
Data: 4 EC50
Activity Spreadsheet -- Enzyme Inhibition Constant Data from BindingDB
Found 4 hits for monomerid = 50394977
Trg + Lig
Ki
nM
ΔG°
kcal/mole
IC50
nM
Kd
nM
EC50/IC50
nM
koff
s-1
kon
M-1s-1
pHTemp
°C
Neuropeptide FF receptor 2
(Homo sapiens (Human))
BDBM50394977
(CHEMBL583068)
Show SMILES [#7]\[#6](-[#7])=[#7]\[#7]=[#6]-c1ccc(Cl)c(c1)C(F)(F)F |w:5.5|
Show InChI InChI=1S/C9H8ClF3N4/c10-7-2-1-5(4-16-17-8(14)15)3-6(7)9(11,12)13/h1-4H,(H4,14,15,17)
n/an/an/an/a 1.19E+3n/an/an/an/a
Leipzig University
Curated by ChEMBL
Assay Description
Agonist activity at human NPFF2 receptor expressed in COS1 cells assessed as [3H]inositol phosphate accumulation after 2 hrs by liquid scintillation ...
J Med Chem 55: 6124-36 (2012)
Article DOI: 10.1021/jm300535s
BindingDB Entry DOI: 10.7270/Q26974PV
Neuropeptide FF receptor 1
(Homo sapiens (Human))
BDBM50394977
(CHEMBL583068)
Show SMILES [#7]\[#6](-[#7])=[#7]\[#7]=[#6]-c1ccc(Cl)c(c1)C(F)(F)F |w:5.5|
Show InChI InChI=1S/C9H8ClF3N4/c10-7-2-1-5(4-16-17-8(14)15)3-6(7)9(11,12)13/h1-4H,(H4,14,15,17)
Reactome pathway
n/an/an/an/a>3.16E+3n/an/an/an/a
ACADIA Pharmaceuticals AB
Curated by ChEMBL
Assay Description
Agonist activity at human NPFF1 receptor expressed in cells assessed as beta-galactosidase levels after 5 days
J Med Chem 52: 6511-4 (2009)
Article DOI: 10.1021/jm9011998
BindingDB Entry DOI: 10.7270/Q2G73FZF
Neuropeptide FF receptor 2
(Homo sapiens (Human))
BDBM50394977
(CHEMBL583068)
Show SMILES [#7]\[#6](-[#7])=[#7]\[#7]=[#6]-c1ccc(Cl)c(c1)C(F)(F)F |w:5.5|
Show InChI InChI=1S/C9H8ClF3N4/c10-7-2-1-5(4-16-17-8(14)15)3-6(7)9(11,12)13/h1-4H,(H4,14,15,17)
n/an/an/an/a 501n/an/an/an/a
ACADIA Pharmaceuticals AB
Curated by ChEMBL
Assay Description
Agonist activity at human NPFF2 receptor expressed in cells assessed as beta-galactosidase levels after 5 days
J Med Chem 52: 6511-4 (2009)
Article DOI: 10.1021/jm9011998
BindingDB Entry DOI: 10.7270/Q2G73FZF
Neuropeptide FF receptor 1
(Homo sapiens (Human))
BDBM50394977
(CHEMBL583068)
Show SMILES [#7]\[#6](-[#7])=[#7]\[#7]=[#6]-c1ccc(Cl)c(c1)C(F)(F)F |w:5.5|
Show InChI InChI=1S/C9H8ClF3N4/c10-7-2-1-5(4-16-17-8(14)15)3-6(7)9(11,12)13/h1-4H,(H4,14,15,17)
Reactome pathway
n/an/an/an/a 2.37E+3n/an/an/an/a
Leipzig University
Curated by ChEMBL
Assay Description
Agonist activity at human NPFF1 receptor expressed in COS1 cells assessed as [3H]inositol phosphate accumulation after 2 hrs by liquid scintillation ...
J Med Chem 55: 6124-36 (2012)
Article DOI: 10.1021/jm300535s
BindingDB Entry DOI: 10.7270/Q26974PV