BDBM50394992 CHEMBL2163437
SMILES: C[C@H](NC(=O)[C@H](C)NC(=O)N(Cc1ccccc1)NC(=O)C(N)Cc1cnc[nH]1)C(=O)N[C@H](Cc1ccccc1)C(=O)N[C@@H](CCCCN)C(N)=O
InChI Key: InChIKey=AHDAGHCWYONEID-KAGDSSDTSA-N
Data: 2 IC50
Activity Spreadsheet -- Enzyme Inhibition Constant Data from BindingDB
Found 2 hits for monomerid = 50394992
Trg + Lig
Ki
nM
ΔG°
kcal/mole
IC50
nM
Kd
nM
EC50/IC50
nM
koff
s-1
kon
M-1s-1
pHTemp
°C
Ghrelin receptor
(Homo sapiens (Human))
BDBM50394992
(CHEMBL2163437)
Show SMILES C[C@H](NC(=O)[C@H](C)NC(=O)N(Cc1ccccc1)NC(=O)C(N)Cc1cnc[nH]1)C(=O)N[C@H](Cc1ccccc1)C(=O)N[C@@H](CCCCN)C(N)=O |r|
Show InChI InChI=1S/C35H49N11O6/c1-22(32(49)44-29(17-24-11-5-3-6-12-24)34(51)43-28(30(38)47)15-9-10-16-36)41-31(48)23(2)42-35(52)46(20-25-13-7-4-8-14-25)45-33(50)27(37)18-26-19-39-21-40-26/h3-8,11-14,19,21-23,27-29H,9-10,15-18,20,36-37H2,1-2H3,(H2,38,47)(H,39,40)(H,41,48)(H,42,52)(H,43,51)(H,44,49)(H,45,50)/t22-,23-,27?,28-,29+/m0/s1
Reactome pathway
n/an/a>1.00E+4n/an/an/an/an/an/a
Universit£ de Montr£al
Curated by ChEMBL
Assay Description
Displacement of [125I]ghrelin expressed in in LLC-PK1 cells incubated for 1 hr by gamma counting method
J Med Chem 55: 6502-11 (2012)
Article DOI: 10.1021/jm300557t
BindingDB Entry DOI: 10.7270/Q22J6D00
Platelet glycoprotein 4
(Rattus norvegicus)
BDBM50394992
(CHEMBL2163437)
Show SMILES C[C@H](NC(=O)[C@H](C)NC(=O)N(Cc1ccccc1)NC(=O)C(N)Cc1cnc[nH]1)C(=O)N[C@H](Cc1ccccc1)C(=O)N[C@@H](CCCCN)C(N)=O |r|
Show InChI InChI=1S/C35H49N11O6/c1-22(32(49)44-29(17-24-11-5-3-6-12-24)34(51)43-28(30(38)47)15-9-10-16-36)41-31(48)23(2)42-35(52)46(20-25-13-7-4-8-14-25)45-33(50)27(37)18-26-19-39-21-40-26/h3-8,11-14,19,21-23,27-29H,9-10,15-18,20,36-37H2,1-2H3,(H2,38,47)(H,39,40)(H,41,48)(H,42,52)(H,43,51)(H,44,49)(H,45,50)/t22-,23-,27?,28-,29+/m0/s1
Reactome pathway
n/an/a>1.00E+4n/an/an/an/an/an/a
Universit£ de Montr£al
Curated by ChEMBL
Assay Description
Displacement of photoactivatable [125I]-Tyr-Bpa-Ala-Hexarelin from CD36 in Sprague-Dawley rat cardiac membranes incubated for 60 mins by densitometry
J Med Chem 55: 6502-11 (2012)
Article DOI: 10.1021/jm300557t
BindingDB Entry DOI: 10.7270/Q22J6D00