BDBM50395010 CHEMBL2163458
SMILES: NCCCC[C@H](NC(=O)[C@@H](Cc1ccccc1)NC(=O)[C@@H]1CCCN1C(=O)NNC(=O)[C@@H](Cc1c[nH]c2ccccc12)NC(=O)[C@@H](N)Cc1cnc[nH]1)C(N)=O
InChI Key: InChIKey=NJYRGXRJNYQERA-SKRLODENSA-N
Data: 2 IC50
Activity Spreadsheet -- Enzyme Inhibition Constant Data from BindingDB
Found 2 hits for monomerid = 50395010
Trg + Lig
Ki
nM
ΔG°
kcal/mole
IC50
nM
Kd
nM
EC50/IC50
nM
koff
s-1
kon
M-1s-1
pHTemp
°C
Platelet glycoprotein 4
(Rattus norvegicus)
BDBM50395010
(CHEMBL2163458)
Show SMILES NCCCC[C@H](NC(=O)[C@@H](Cc1ccccc1)NC(=O)[C@@H]1CCCN1C(=O)NNC(=O)[C@@H](Cc1c[nH]c2ccccc12)NC(=O)[C@@H](N)Cc1cnc[nH]1)C(N)=O |r|
Show InChI InChI=1S/C38H50N12O6/c39-15-7-6-13-29(33(41)51)45-35(53)30(17-23-9-2-1-3-10-23)47-37(55)32-14-8-16-50(32)38(56)49-48-36(54)31(18-24-20-43-28-12-5-4-11-26(24)28)46-34(52)27(40)19-25-21-42-22-44-25/h1-5,9-12,20-22,27,29-32,43H,6-8,13-19,39-40H2,(H2,41,51)(H,42,44)(H,45,53)(H,46,52)(H,47,55)(H,48,54)(H,49,56)/t27-,29-,30+,31+,32-/m0/s1
Reactome pathway
n/an/a>1.00E+4n/an/an/an/an/an/a
Universit£ de Montr£al
Curated by ChEMBL
Assay Description
Displacement of photoactivatable [125I]-Tyr-Bpa-Ala-Hexarelin from CD36 in Sprague-Dawley rat cardiac membranes incubated for 60 mins by densitometry
J Med Chem 55: 6502-11 (2012)
Article DOI: 10.1021/jm300557t
BindingDB Entry DOI: 10.7270/Q22J6D00
Ghrelin receptor
(Homo sapiens (Human))
BDBM50395010
(CHEMBL2163458)
Show SMILES NCCCC[C@H](NC(=O)[C@@H](Cc1ccccc1)NC(=O)[C@@H]1CCCN1C(=O)NNC(=O)[C@@H](Cc1c[nH]c2ccccc12)NC(=O)[C@@H](N)Cc1cnc[nH]1)C(N)=O |r|
Show InChI InChI=1S/C38H50N12O6/c39-15-7-6-13-29(33(41)51)45-35(53)30(17-23-9-2-1-3-10-23)47-37(55)32-14-8-16-50(32)38(56)49-48-36(54)31(18-24-20-43-28-12-5-4-11-26(24)28)46-34(52)27(40)19-25-21-42-22-44-25/h1-5,9-12,20-22,27,29-32,43H,6-8,13-19,39-40H2,(H2,41,51)(H,42,44)(H,45,53)(H,46,52)(H,47,55)(H,48,54)(H,49,56)/t27-,29-,30+,31+,32-/m0/s1
Reactome pathway
n/an/a>1.00E+4n/an/an/an/an/an/a
Universit£ de Montr£al
Curated by ChEMBL
Assay Description
Displacement of [125I]ghrelin expressed in in LLC-PK1 cells incubated for 1 hr by gamma counting method
J Med Chem 55: 6502-11 (2012)
Article DOI: 10.1021/jm300557t
BindingDB Entry DOI: 10.7270/Q22J6D00