BDBM50395234 CHEMBL2164669
SMILES: Fc1ccc(cc1)N1CCN(CC1)C(=O)[C@@H]1CCCC[C@H]1C(=O)NC(C#N)c1ccccc1
InChI Key: InChIKey=XTBBBYLRJBRVPZ-YOQGVNIDSA-N
Data: 2 IC50
Activity Spreadsheet -- Enzyme Inhibition Constant Data from BindingDB
Found 2 hits for monomerid = 50395234
Trg + Lig
Ki
nM
ΔG°
kcal/mole
IC50
nM
Kd
nM
EC50/IC50
nM
koff
s-1
kon
M-1s-1
pHTemp
°C
Cathepsin S
(Homo sapiens (Human))
BDBM50395234
(CHEMBL2164669)
Show SMILES Fc1ccc(cc1)N1CCN(CC1)C(=O)[C@@H]1CCCC[C@H]1C(=O)NC(C#N)c1ccccc1 |r|
Show InChI InChI=1S/C26H29FN4O2/c27-20-10-12-21(13-11-20)30-14-16-31(17-15-30)26(33)23-9-5-4-8-22(23)25(32)29-24(18-28)19-6-2-1-3-7-19/h1-3,6-7,10-13,22-24H,4-5,8-9,14-17H2,(H,29,32)/t22-,23-,24?/m1/s1
Reactome pathway
n/an/a 258n/an/an/an/an/an/a
AstraZeneca
Curated by ChEMBL
Assay Description
Inhibition of human recombinant CatS assessed as suppression of enzyme-mediated Z-Val-Val-Arg-AMC cleavage by QFRET assay
J Med Chem 55: 6363-74 (2012)
Article DOI: 10.1021/jm3007257
BindingDB Entry DOI: 10.7270/Q2833T5F
Cathepsin K
(Homo sapiens (Human))
BDBM50395234
(CHEMBL2164669)
Show SMILES Fc1ccc(cc1)N1CCN(CC1)C(=O)[C@@H]1CCCC[C@H]1C(=O)NC(C#N)c1ccccc1 |r|
Show InChI InChI=1S/C26H29FN4O2/c27-20-10-12-21(13-11-20)30-14-16-31(17-15-30)26(33)23-9-5-4-8-22(23)25(32)29-24(18-28)19-6-2-1-3-7-19/h1-3,6-7,10-13,22-24H,4-5,8-9,14-17H2,(H,29,32)/t22-,23-,24?/m1/s1
Reactome pathway
n/an/a 3n/an/an/an/an/an/a
AstraZeneca
Curated by ChEMBL
Assay Description
Inhibition of human recombinant CatK assessed as suppression of enzyme-mediated Z-Phe-Arg-AMC cleavage incubated for 1 hrs by QFRET assay
J Med Chem 55: 6363-74 (2012)
Article DOI: 10.1021/jm3007257
BindingDB Entry DOI: 10.7270/Q2833T5F