BDBM50395319 CHEMBL2164018
SMILES: CCCCCC1CC(=O)c2cc(Br)cc(Br)c2O1
InChI Key: InChIKey=RQNQNBFICWKDSG-UHFFFAOYSA-N
Data: 1 IC50
Activity Spreadsheet -- Enzyme Inhibition Constant Data from BindingDB
Found 1 hit for monomerid = 50395319
Trg + Lig
Ki
nM
ΔG°
kcal/mole
IC50
nM
Kd
nM
EC50/IC50
nM
koff
s-1
kon
M-1s-1
pHTemp
°C
NAD-dependent deacetylase sirtuin 2
(Homo sapiens (Human))
BDBM50395319
(CHEMBL2164018)
Show SMILES CCCCCC1CC(=O)c2cc(Br)cc(Br)c2O1
Show InChI InChI=1S/C14H16Br2O2/c1-2-3-4-5-10-8-13(17)11-6-9(15)7-12(16)14(11)18-10/h6-7,10H,2-5,8H2,1H3
NCI pathway
n/an/a 1.50E+3n/an/an/an/an/an/a
University of Gothenburg
Curated by ChEMBL
Assay Description
Inhibition of human recombinant GST-tagged SIRT2 preincubated for 5 mins measured after 1 hr by Fluor de Lys-based fluorescence assay
J Med Chem 55: 7104-13 (2012)
Article DOI: 10.1021/jm3005288
BindingDB Entry DOI: 10.7270/Q2VT1T6N