BDBM50395355 CHEMBL2164358
SMILES: FC(F)(F)Oc1ccc(CNC(=O)C2N(CCOc3ccccn3)C(=O)c3ccccc23)cc1
InChI Key: InChIKey=HLRYIKVEQMWFJE-UHFFFAOYSA-N
Data: 4 IC50
Activity Spreadsheet -- Enzyme Inhibition Constant Data from BindingDB
Found 4 hits for monomerid = 50395355
Trg + Lig
Ki
nM
ΔG°
kcal/mole
IC50
nM
Kd
nM
EC50/IC50
nM
koff
s-1
kon
M-1s-1
pHTemp
°C
Potassium voltage-gated channel subfamily H member 2
(Homo sapiens (Human))
BDBM50395355
(CHEMBL2164358)
Show SMILES FC(F)(F)Oc1ccc(CNC(=O)C2N(CCOc3ccccn3)C(=O)c3ccccc23)cc1
Show InChI InChI=1S/C24H20F3N3O4/c25-24(26,27)34-17-10-8-16(9-11-17)15-29-22(31)21-18-5-1-2-6-19(18)23(32)30(21)13-14-33-20-7-3-4-12-28-20/h1-12,21H,13-15H2,(H,29,31)
Reactome pathway
n/an/a 4.90E+3n/an/an/an/an/an/a
AstraZeneca
Curated by ChEMBL
Assay Description
Binding affinity to human ERG expressed in CHOK1 cells by IonWorks HT assay
J Med Chem 55: 6866-80 (2012)
Article DOI: 10.1021/jm300623u
BindingDB Entry DOI: 10.7270/Q2M909SB
Sodium channel protein type 5 subunit alpha
(Homo sapiens (Human))
BDBM50395355
(CHEMBL2164358)
Show SMILES FC(F)(F)Oc1ccc(CNC(=O)C2N(CCOc3ccccn3)C(=O)c3ccccc23)cc1
Show InChI InChI=1S/C24H20F3N3O4/c25-24(26,27)34-17-10-8-16(9-11-17)15-29-22(31)21-18-5-1-2-6-19(18)23(32)30(21)13-14-33-20-7-3-4-12-28-20/h1-12,21H,13-15H2,(H,29,31)
n/an/a 9.70E+3n/an/an/an/an/an/a
AstraZeneca
Curated by ChEMBL
Assay Description
Inhibition of human NaV1.5 alpha subunit expressed in CHOK1 cells at -90 mV holding potential by patch clamp electrophysiological assay
J Med Chem 55: 6866-80 (2012)
Article DOI: 10.1021/jm300623u
BindingDB Entry DOI: 10.7270/Q2M909SB
Sodium channel protein type 9 subunit alpha
(Homo sapiens (Human))
BDBM50395355
(CHEMBL2164358)
Show SMILES FC(F)(F)Oc1ccc(CNC(=O)C2N(CCOc3ccccn3)C(=O)c3ccccc23)cc1
Show InChI InChI=1S/C24H20F3N3O4/c25-24(26,27)34-17-10-8-16(9-11-17)15-29-22(31)21-18-5-1-2-6-19(18)23(32)30(21)13-14-33-20-7-3-4-12-28-20/h1-12,21H,13-15H2,(H,29,31)
n/an/a 82n/an/an/an/an/an/a
AstraZeneca
Curated by ChEMBL
Assay Description
Inhibition of recombinant human NaV1.7 alpha subunit expressed in HEK293 cells at -65 mV holding potential by patch clamp electrophysiological assay
J Med Chem 55: 6866-80 (2012)
Article DOI: 10.1021/jm300623u
BindingDB Entry DOI: 10.7270/Q2M909SB
Sodium channel protein type 9 subunit alpha
(Homo sapiens (Human))
BDBM50395355
(CHEMBL2164358)
Show SMILES FC(F)(F)Oc1ccc(CNC(=O)C2N(CCOc3ccccn3)C(=O)c3ccccc23)cc1
Show InChI InChI=1S/C24H20F3N3O4/c25-24(26,27)34-17-10-8-16(9-11-17)15-29-22(31)21-18-5-1-2-6-19(18)23(32)30(21)13-14-33-20-7-3-4-12-28-20/h1-12,21H,13-15H2,(H,29,31)
n/an/a 1.80E+4n/an/an/an/an/an/a
AstraZeneca
Curated by ChEMBL
Assay Description
Inhibition of recombinant human NaV1.7 alpha subunit expressed in HEK293 cells at -90 mV holding potential by patch clamp electrophysiological assay
J Med Chem 55: 6866-80 (2012)
Article DOI: 10.1021/jm300623u
BindingDB Entry DOI: 10.7270/Q2M909SB