BDBM50395358 CHEMBL2164046
SMILES: FC(F)(F)Oc1ccc(CNC(=O)C2N(CCc3ccncc3)C(=O)c3ccccc23)cc1
InChI Key: InChIKey=QMUDOESFACZEJE-UHFFFAOYSA-N
Data: 3 IC50
Activity Spreadsheet -- Enzyme Inhibition Constant Data from BindingDB
Found 3 hits for monomerid = 50395358
Trg + Lig
Ki
nM
ΔG°
kcal/mole
IC50
nM
Kd
nM
EC50/IC50
nM
koff
s-1
kon
M-1s-1
pHTemp
°C
Potassium voltage-gated channel subfamily H member 2
(Homo sapiens (Human))
BDBM50395358
(CHEMBL2164046)
Show SMILES FC(F)(F)Oc1ccc(CNC(=O)C2N(CCc3ccncc3)C(=O)c3ccccc23)cc1
Show InChI InChI=1S/C24H20F3N3O3/c25-24(26,27)33-18-7-5-17(6-8-18)15-29-22(31)21-19-3-1-2-4-20(19)23(32)30(21)14-11-16-9-12-28-13-10-16/h1-10,12-13,21H,11,14-15H2,(H,29,31)
Reactome pathway
n/an/a 5.10E+3n/an/an/an/an/an/a
AstraZeneca
Curated by ChEMBL
Assay Description
Binding affinity to human ERG expressed in CHOK1 cells by IonWorks HT assay
J Med Chem 55: 6866-80 (2012)
Article DOI: 10.1021/jm300623u
BindingDB Entry DOI: 10.7270/Q2M909SB
Sodium channel protein type 5 subunit alpha
(Homo sapiens (Human))
BDBM50395358
(CHEMBL2164046)
Show SMILES FC(F)(F)Oc1ccc(CNC(=O)C2N(CCc3ccncc3)C(=O)c3ccccc23)cc1
Show InChI InChI=1S/C24H20F3N3O3/c25-24(26,27)33-18-7-5-17(6-8-18)15-29-22(31)21-19-3-1-2-4-20(19)23(32)30(21)14-11-16-9-12-28-13-10-16/h1-10,12-13,21H,11,14-15H2,(H,29,31)
n/an/a 6.10E+3n/an/an/an/an/an/a
AstraZeneca
Curated by ChEMBL
Assay Description
Inhibition of human NaV1.5 alpha subunit expressed in CHOK1 cells at -90 mV holding potential by patch clamp electrophysiological assay
J Med Chem 55: 6866-80 (2012)
Article DOI: 10.1021/jm300623u
BindingDB Entry DOI: 10.7270/Q2M909SB
Sodium channel protein type 9 subunit alpha
(Homo sapiens (Human))
BDBM50395358
(CHEMBL2164046)
Show SMILES FC(F)(F)Oc1ccc(CNC(=O)C2N(CCc3ccncc3)C(=O)c3ccccc23)cc1
Show InChI InChI=1S/C24H20F3N3O3/c25-24(26,27)33-18-7-5-17(6-8-18)15-29-22(31)21-19-3-1-2-4-20(19)23(32)30(21)14-11-16-9-12-28-13-10-16/h1-10,12-13,21H,11,14-15H2,(H,29,31)
n/an/a 310n/an/an/an/an/an/a
AstraZeneca
Curated by ChEMBL
Assay Description
Inhibition of recombinant human NaV1.7 alpha subunit expressed in HEK293 cells at -65 mV holding potential by patch clamp electrophysiological assay
J Med Chem 55: 6866-80 (2012)
Article DOI: 10.1021/jm300623u
BindingDB Entry DOI: 10.7270/Q2M909SB