BDBM50395427 CHEMBL2165073
SMILES: Cc1oc(cc1C(N)=O)-c1cccc(OC(=O)NCCCCCCc2ccccc2)c1
InChI Key: InChIKey=BGVKGSQKNCQLDU-UHFFFAOYSA-N
Data: 1 KI  1 IC50
Activity Spreadsheet -- Enzyme Inhibition Constant Data from BindingDB
Found 2 hits for monomerid = 50395427
Trg + Lig
Ki
nM
ΔG°
kcal/mole
IC50
nM
Kd
nM
EC50/IC50
nM
koff
s-1
kon
M-1s-1
pHTemp
°C
Anandamide amidohydrolase
(Mus musculus (mouse))
BDBM50395427
(CHEMBL2165073)
Show SMILES Cc1oc(cc1C(N)=O)-c1cccc(OC(=O)NCCCCCCc2ccccc2)c1
Show InChI InChI=1S/C25H28N2O4/c1-18-22(24(26)28)17-23(30-18)20-13-9-14-21(16-20)31-25(29)27-15-8-3-2-5-10-19-11-6-4-7-12-19/h4,6-7,9,11-14,16-17H,2-3,5,8,10,15H2,1H3,(H2,26,28)(H,27,29)
4.80n/an/an/an/an/an/an/an/a
Universit£ degli Studi di Siena
Curated by ChEMBL
Assay Description
Inhibition of mouse FAAH isolated from brain homogenate using [3H-ethanolamine]AEA as substrate incubated for 20 mins prior to substrate addition mea...
J Med Chem 55: 6898-915 (2012)
Article DOI: 10.1021/jm300689c
BindingDB Entry DOI: 10.7270/Q2ZK5HSK
Anandamide amidohydrolase
(Mus musculus (mouse))
BDBM50395427
(CHEMBL2165073)
Show SMILES Cc1oc(cc1C(N)=O)-c1cccc(OC(=O)NCCCCCCc2ccccc2)c1
Show InChI InChI=1S/C25H28N2O4/c1-18-22(24(26)28)17-23(30-18)20-13-9-14-21(16-20)31-25(29)27-15-8-3-2-5-10-19-11-6-4-7-12-19/h4,6-7,9,11-14,16-17H,2-3,5,8,10,15H2,1H3,(H2,26,28)(H,27,29)
n/an/a 18n/an/an/an/an/an/a
Universit£ degli Studi di Siena
Curated by ChEMBL
Assay Description
Inhibition of mouse FAAH isolated from brain homogenate using [3H-ethanolamine]AEA as substrate incubated for 20 mins prior to substrate addition mea...
J Med Chem 55: 6898-915 (2012)
Article DOI: 10.1021/jm300689c
BindingDB Entry DOI: 10.7270/Q2ZK5HSK