BDBM50395484 CHEMBL2163663
SMILES: Clc1ccc(CC(=O)Nc2ccccc2N2CCCC2)cc1
InChI Key: InChIKey=NNYYFRFRGKSZST-UHFFFAOYSA-N
Data: 1 EC50
Activity Spreadsheet -- Enzyme Inhibition Constant Data from BindingDB
Found 1 hit for monomerid = 50395484
Trg + Lig
Ki
nM
ΔG°
kcal/mole
IC50
nM
Kd
nM
EC50/IC50
nM
koff
s-1
kon
M-1s-1
pHTemp
°C
KCNQ (Kv7) potassium channel
(Homo sapiens (Human))
BDBM50395484
(CHEMBL2163663)
Show SMILES Clc1ccc(CC(=O)Nc2ccccc2N2CCCC2)cc1
Show InChI InChI=1S/C18H19ClN2O/c19-15-9-7-14(8-10-15)13-18(22)20-16-5-1-2-6-17(16)21-11-3-4-12-21/h1-2,5-10H,3-4,11-13H2,(H,20,22)
Reactome pathway
n/an/an/an/a 800n/an/an/an/a
Vanderbilt University Medical Center
Curated by ChEMBL
Assay Description
Agonist activity at KCNQ2 expressed in CHO cells incubated for 3 mins by automated patch clamp assay
J Med Chem 55: 6975-9 (2012)
Article DOI: 10.1021/jm300700v
BindingDB Entry DOI: 10.7270/Q2KD2017