BDBM50395501 CHEMBL2163658
SMILES: CCC(C(=O)Nc1ccccc1N1CCCC1)c1cccc(OC)c1
InChI Key: InChIKey=BWXLEAFOTTVRLB-UHFFFAOYSA-N
Data: 1 IC50
Activity Spreadsheet -- Enzyme Inhibition Constant Data from BindingDB
Found 1 hit for monomerid = 50395501
Trg + Lig
Ki
nM
ΔG°
kcal/mole
IC50
nM
Kd
nM
EC50/IC50
nM
koff
s-1
kon
M-1s-1
pHTemp
°C
KCNQ (Kv7) potassium channel
(Homo sapiens (Human))
BDBM50395501
(CHEMBL2163658)
Show SMILES CCC(C(=O)Nc1ccccc1N1CCCC1)c1cccc(OC)c1
Show InChI InChI=1S/C21H26N2O2/c1-3-18(16-9-8-10-17(15-16)25-2)21(24)22-19-11-4-5-12-20(19)23-13-6-7-14-23/h4-5,8-12,15,18H,3,6-7,13-14H2,1-2H3,(H,22,24)
Reactome pathway
n/an/a 120n/an/an/an/an/an/a
Vanderbilt University Medical Center
Curated by ChEMBL
Assay Description
Antagonist activity at KCNQ2 expressed in CHO cells incubated for 3 mins by automated patch clamp assay
J Med Chem 55: 6975-9 (2012)
Article DOI: 10.1021/jm300700v
BindingDB Entry DOI: 10.7270/Q2KD2017