BDBM50395681 CHEMBL2164086
SMILES: CCCCNc1nc(NCc2csc(n2)-c2cccs2)nc(n1)N1CCC[C@@H]1CNS(=O)(=O)c1ccc(O)cc1
InChI Key: InChIKey=UNRIQSYPMLOPEU-LJQANCHMSA-N
Data: 1 IC50
Activity Spreadsheet -- Enzyme Inhibition Constant Data from BindingDB
Found 1 hit for monomerid = 50395681
Trg + Lig
Ki
nM
ΔG°
kcal/mole
IC50
nM
Kd
nM
EC50/IC50
nM
koff
s-1
kon
M-1s-1
pHTemp
°C
A disintegrin and metalloproteinase with thrombospondin motifs 5 (ADAMTS-5)
(Homo sapiens (Human))
BDBM50395681
(CHEMBL2164086)
Show SMILES CCCCNc1nc(NCc2csc(n2)-c2cccs2)nc(n1)N1CCC[C@@H]1CNS(=O)(=O)c1ccc(O)cc1 |r|
Show InChI InChI=1S/C26H32N8O3S3/c1-2-3-12-27-24-31-25(28-15-18-17-39-23(30-18)22-7-5-14-38-22)33-26(32-24)34-13-4-6-19(34)16-29-40(36,37)21-10-8-20(35)9-11-21/h5,7-11,14,17,19,29,35H,2-4,6,12-13,15-16H2,1H3,(H2,27,28,31,32,33)/t19-/m1/s1
Reactome pathway
n/an/a 2.60E+3n/an/an/an/an/an/a
GlaxoSmithKline
Curated by ChEMBL
Assay Description
Inhibition of human ADAMTS-5 expressed in CHO cells using WAAG-3R as substrate preincubated for 15 mins measured after 1 hr by FRET assay
J Med Chem 55: 7061-79 (2012)
Article DOI: 10.1021/jm300449x
BindingDB Entry DOI: 10.7270/Q2RX9D6T