BDBM50395685 CHEMBL2164082
SMILES: CCCCNc1nc(NCc2csc(n2)-c2cccs2)nc(n1)N1CCC[C@@H]1CNS(=O)(=O)c1ccc(cc1)C#N
InChI Key: InChIKey=ADOJFDCNMBNVHP-OAQYLSRUSA-N
Data: 1 IC50
Activity Spreadsheet -- Enzyme Inhibition Constant Data from BindingDB
Found 1 hit for monomerid = 50395685
Trg + Lig
Ki
nM
ΔG°
kcal/mole
IC50
nM
Kd
nM
EC50/IC50
nM
koff
s-1
kon
M-1s-1
pHTemp
°C
A disintegrin and metalloproteinase with thrombospondin motifs 5 (ADAMTS-5)
(Homo sapiens (Human))
BDBM50395685
(CHEMBL2164082)
Show SMILES CCCCNc1nc(NCc2csc(n2)-c2cccs2)nc(n1)N1CCC[C@@H]1CNS(=O)(=O)c1ccc(cc1)C#N |r|
Show InChI InChI=1S/C27H31N9O2S3/c1-2-3-12-29-25-33-26(30-16-20-18-40-24(32-20)23-7-5-14-39-23)35-27(34-25)36-13-4-6-21(36)17-31-41(37,38)22-10-8-19(15-28)9-11-22/h5,7-11,14,18,21,31H,2-4,6,12-13,16-17H2,1H3,(H2,29,30,33,34,35)/t21-/m1/s1
Reactome pathway
n/an/a 1.80E+3n/an/an/an/an/an/a
GlaxoSmithKline
Curated by ChEMBL
Assay Description
Inhibition of human ADAMTS-5 expressed in CHO cells using WAAG-3R as substrate preincubated for 15 mins measured after 1 hr by FRET assay
J Med Chem 55: 7061-79 (2012)
Article DOI: 10.1021/jm300449x
BindingDB Entry DOI: 10.7270/Q2RX9D6T