BDBM50395715 CHEMBL2164114
SMILES: CCCc1ccc(cc1)S(=O)(=O)NC[C@H]1CCCN1c1nc(NCCO)nc(NCc2csc(n2)-c2ccccc2)n1
InChI Key: InChIKey=KXTJCVAXKHHIAZ-XMMPIXPASA-N
Data: 1 IC50
Activity Spreadsheet -- Enzyme Inhibition Constant Data from BindingDB
Found 1 hit for monomerid = 50395715
Trg + Lig
Ki
nM
ΔG°
kcal/mole
IC50
nM
Kd
nM
EC50/IC50
nM
koff
s-1
kon
M-1s-1
pHTemp
°C
A disintegrin and metalloproteinase with thrombospondin motifs 5 (ADAMTS-5)
(Homo sapiens (Human))
BDBM50395715
(CHEMBL2164114)
Show SMILES CCCc1ccc(cc1)S(=O)(=O)NC[C@H]1CCCN1c1nc(NCCO)nc(NCc2csc(n2)-c2ccccc2)n1 |r|
Show InChI InChI=1S/C29H36N8O3S2/c1-2-7-21-11-13-25(14-12-21)42(39,40)32-19-24-10-6-16-37(24)29-35-27(30-15-17-38)34-28(36-29)31-18-23-20-41-26(33-23)22-8-4-3-5-9-22/h3-5,8-9,11-14,20,24,32,38H,2,6-7,10,15-19H2,1H3,(H2,30,31,34,35,36)/t24-/m1/s1
Reactome pathway
n/an/a 260n/an/an/an/an/an/a
GlaxoSmithKline
Curated by ChEMBL
Assay Description
Inhibition of human ADAMTS-5 expressed in CHO cells using WAAG-3R as substrate preincubated for 15 mins measured after 1 hr by FRET assay
J Med Chem 55: 7061-79 (2012)
Article DOI: 10.1021/jm300449x
BindingDB Entry DOI: 10.7270/Q2RX9D6T