BDBM50395758 CHEMBL2164823
SMILES: CCN1CCN(CC(=O)NC2(C(=O)Nc3cc(Cl)c(Cl)cc23)c2ccc(Cl)cc2)CC1
InChI Key: InChIKey=RXIJXXRJSNUVDQ-UHFFFAOYSA-N
Data: 1 KI  1 IC50
Activity Spreadsheet -- Enzyme Inhibition Constant Data from BindingDB
Found 2 hits for monomerid = 50395758
Trg + Lig
Ki
nM
ΔG°
kcal/mole
IC50
nM
Kd
nM
EC50/IC50
nM
koff
s-1
kon
M-1s-1
pHTemp
°C
Ghrelin receptor
(Homo sapiens (Human))
BDBM50395758
(CHEMBL2164823)
Show SMILES CCN1CCN(CC(=O)NC2(C(=O)Nc3cc(Cl)c(Cl)cc23)c2ccc(Cl)cc2)CC1
Show InChI InChI=1S/C22H23Cl3N4O2/c1-2-28-7-9-29(10-8-28)13-20(30)27-22(14-3-5-15(23)6-4-14)16-11-17(24)18(25)12-19(16)26-21(22)31/h3-6,11-12H,2,7-10,13H2,1H3,(H,26,31)(H,27,30)
Reactome pathway
202n/an/an/an/an/an/an/an/a
Sanofi Research
Curated by ChEMBL
Assay Description
Displacement of [125I]-ghrelin from human GHSR1 expressed in CHO-CREluc cells after 1 hr by scintillation counting
Bioorg Med Chem 20: 5623-36 (2012)
Article DOI: 10.1016/j.bmc.2012.07.018
BindingDB Entry DOI: 10.7270/Q2HD7WS4
Ghrelin receptor
(Homo sapiens (Human))
BDBM50395758
(CHEMBL2164823)
Show SMILES CCN1CCN(CC(=O)NC2(C(=O)Nc3cc(Cl)c(Cl)cc23)c2ccc(Cl)cc2)CC1
Show InChI InChI=1S/C22H23Cl3N4O2/c1-2-28-7-9-29(10-8-28)13-20(30)27-22(14-3-5-15(23)6-4-14)16-11-17(24)18(25)12-19(16)26-21(22)31/h3-6,11-12H,2,7-10,13H2,1H3,(H,26,31)(H,27,30)
Reactome pathway
n/an/a 110n/an/an/an/an/an/a
Sanofi Research
Curated by ChEMBL
Assay Description
Antagonist activity at human GHSR1 expressed in CHO-CREluc cells after 4 hrs by Luciferase reporter assay
Bioorg Med Chem 20: 5623-36 (2012)
Article DOI: 10.1016/j.bmc.2012.07.018
BindingDB Entry DOI: 10.7270/Q2HD7WS4