BDBM50395907 CHEMBL2164525
SMILES: C[C@@](CCn1cc(nn1)-c1ccc(Cl)c(Cl)c1)(C(=O)NO)S(C)(=O)=O
InChI Key: InChIKey=AMWYDYWCVJXLKY-CQSZACIVSA-N
Data: 1 IC50
Activity Spreadsheet -- Enzyme Inhibition Constant Data from BindingDB
Found 1 hit for monomerid = 50395907
Trg + Lig
Ki
nM
ΔG°
kcal/mole
IC50
nM
Kd
nM
EC50/IC50
nM
koff
s-1
kon
M-1s-1
pHTemp
°C
UDP-3-O-acyl-N-acetylglucosamine deacetylase
(Pseudomonas aeruginosa)
BDBM50395907
(CHEMBL2164525)
Show SMILES C[C@@](CCn1cc(nn1)-c1ccc(Cl)c(Cl)c1)(C(=O)NO)S(C)(=O)=O |r|
Show InChI InChI=1S/C14H16Cl2N4O4S/c1-14(13(21)18-22,25(2,23)24)5-6-20-8-12(17-19-20)9-3-4-10(15)11(16)7-9/h3-4,7-8,22H,5-6H2,1-2H3,(H,18,21)/t14-/m1/s1
n/an/a 1.67n/an/an/an/an/an/a
Pfizer Inc.
Curated by ChEMBL
Assay Description
Inhibition of Pseudomonas aeruginosa LpxC
Bioorg Med Chem Lett 22: 6832-8 (2012)
Article DOI: 10.1016/j.bmcl.2012.09.058
BindingDB Entry DOI: 10.7270/Q2GF0VMV