null
SMILES: Fc1cc(cc(c1)-c1ccc(o1)-c1ccccn1)C#N
InChI Key: InChIKey=ISBNKTIGDJTIOG-UHFFFAOYSA-N
Activity Spreadsheet -- Enzyme Inhibition Constant Data from BindingDB
Found 1 hit for monomerid = 50395940
Trg + Lig
Ki
nM
ΔG°
kcal/mole
IC50
nM
Kd
nM
EC50/IC50
nM
koff
s-1
kon
M-1s-1
pHTemp
°C
Metabotropic glutamate receptor 5
(Homo sapiens (Human))
BDBM50395940
(CHEMBL2164547)
Show SMILES Fc1cc(cc(c1)-c1ccc(o1)-c1ccccn1)C#N
Show InChI InChI=1S/C16H9FN2O/c17-13-8-11(10-18)7-12(9-13)15-4-5-16(20-15)14-3-1-2-6-19-14/h1-9H
n/an/a 61n/an/an/an/an/an/a
AstraZeneca
Curated by ChEMBL
Assay Description
Negative allosteric modulation of human recombinant mGluR5 expressed in HEK293 cells expressing GLAST assessed as inhibition of DHPG-induced intracel...
Bioorg Med Chem Lett 22: 6974-9 (2012)
Article DOI: 10.1016/j.bmcl.2012.08.100
BindingDB Entry DOI: 10.7270/Q2BP03WH