null
SMILES: CN1CCN(CC1)C(=O)C(Cc1cccnc1)c1ccccc1
InChI Key: InChIKey=SCKHVWXVIVMMFL-UHFFFAOYSA-N
Activity Spreadsheet -- Enzyme Inhibition Constant Data from BindingDB
Found 2 hits for monomerid = 50395968
Trg + Lig
Ki
nM
ΔG°
kcal/mole
IC50
nM
Kd
nM
EC50/IC50
nM
koff
s-1
kon
M-1s-1
pHTemp
°C
Muscarinic acetylcholine receptor M1
(Homo sapiens (Human))
BDBM50395968
(CHEMBL2164903)
Show SMILES CN1CCN(CC1)C(=O)C(Cc1cccnc1)c1ccccc1
Show InChI InChI=1S/C19H23N3O/c1-21-10-12-22(13-11-21)19(23)18(17-7-3-2-4-8-17)14-16-6-5-9-20-15-16/h2-9,15,18H,10-14H2,1H3
n/an/a 500n/an/an/an/an/an/a
Vanderbilt University Medical Center
Curated by ChEMBL
Assay Description
Antagonist activity at human muscarinic M1 receptor
Bioorg Med Chem Lett 22: 6923-8 (2012)
Article DOI: 10.1016/j.bmcl.2012.09.011
BindingDB Entry DOI: 10.7270/Q2348MH4
Muscarinic acetylcholine receptor M1
(Homo sapiens (Human))
BDBM50395968
(CHEMBL2164903)
Show SMILES CN1CCN(CC1)C(=O)C(Cc1cccnc1)c1ccccc1
Show InChI InChI=1S/C19H23N3O/c1-21-10-12-22(13-11-21)19(23)18(17-7-3-2-4-8-17)14-16-6-5-9-20-15-16/h2-9,15,18H,10-14H2,1H3
n/an/a 501n/an/an/an/an/an/a
Vanderbilt University Medical Center
Curated by ChEMBL
Assay Description
Antagonist activity at human muscarinic M1 receptor
Bioorg Med Chem Lett 22: 6923-8 (2012)
Article DOI: 10.1016/j.bmcl.2012.09.011
BindingDB Entry DOI: 10.7270/Q2348MH4