BDBM50395975 CHEMBL2164888
SMILES: CN(C)CCOC(=O)C(Cc1ccccc1)c1ccccc1
InChI Key: InChIKey=XNALYUYQYCPCGH-UHFFFAOYSA-N
Data: 2 IC50
Activity Spreadsheet -- Enzyme Inhibition Constant Data from BindingDB
Found 2 hits for monomerid = 50395975
Trg + Lig
Ki
nM
ΔG°
kcal/mole
IC50
nM
Kd
nM
EC50/IC50
nM
koff
s-1
kon
M-1s-1
pHTemp
°C
Muscarinic acetylcholine receptor M1
(Homo sapiens (Human))
BDBM50395975
(CHEMBL2164888)
Show SMILES CN(C)CCOC(=O)C(Cc1ccccc1)c1ccccc1
Show InChI InChI=1S/C19H23NO2/c1-20(2)13-14-22-19(21)18(17-11-7-4-8-12-17)15-16-9-5-3-6-10-16/h3-12,18H,13-15H2,1-2H3
n/an/a 140n/an/an/an/an/an/a
Vanderbilt University Medical Center
Curated by ChEMBL
Assay Description
Antagonist activity at human muscarinic M1 receptor
Bioorg Med Chem Lett 22: 6923-8 (2012)
Article DOI: 10.1016/j.bmcl.2012.09.011
BindingDB Entry DOI: 10.7270/Q2348MH4
Muscarinic acetylcholine receptor M1
(Homo sapiens (Human))
BDBM50395975
(CHEMBL2164888)
Show SMILES CN(C)CCOC(=O)C(Cc1ccccc1)c1ccccc1
Show InChI InChI=1S/C19H23NO2/c1-20(2)13-14-22-19(21)18(17-11-7-4-8-12-17)15-16-9-5-3-6-10-16/h3-12,18H,13-15H2,1-2H3
n/an/a 138n/an/an/an/an/an/a
Vanderbilt University Medical Center
Curated by ChEMBL
Assay Description
Antagonist activity at human muscarinic M1 receptor
Bioorg Med Chem Lett 22: 6923-8 (2012)
Article DOI: 10.1016/j.bmcl.2012.09.011
BindingDB Entry DOI: 10.7270/Q2348MH4