BDBM50396551 CHEMBL2171130
SMILES: Nc1ncc(C2CCNCC2)c2scc(-c3ccc4N(CCc4c3)C(=O)Cc3ccccc3)c12
InChI Key: InChIKey=LCRXWSJBFYHPTM-UHFFFAOYSA-N
Data: 1 IC50
Activity Spreadsheet -- Enzyme Inhibition Constant Data from BindingDB
Found 1 hit for monomerid = 50396551
Trg + Lig
Ki
nM
ΔG°
kcal/mole
IC50
nM
Kd
nM
EC50/IC50
nM
koff
s-1
kon
M-1s-1
pHTemp
°C
Eukaryotic translation initiation factor 2-alpha kinase 3
(Homo sapiens (Human))
BDBM50396551
(CHEMBL2171130)
Show SMILES Nc1ncc(C2CCNCC2)c2scc(-c3ccc4N(CCc4c3)C(=O)Cc3ccccc3)c12
Show InChI InChI=1S/C28H28N4OS/c29-28-26-23(17-34-27(26)22(16-31-28)19-8-11-30-12-9-19)20-6-7-24-21(15-20)10-13-32(24)25(33)14-18-4-2-1-3-5-18/h1-7,15-17,19,30H,8-14H2,(H2,29,31)
n/an/a 1.90n/an/an/an/an/an/a
GlaxoSmithKline Research and Development
Curated by ChEMBL
Assay Description
Inhibition of GST tagged PERK cytoplasmic domain mediated EIF2alpha phosphorylation
J Med Chem 55: 7193-207 (2012)
Article DOI: 10.1021/jm300713s
BindingDB Entry DOI: 10.7270/Q2222VWP