BDBM50396578 CHEMBL2171604
SMILES: Cc1ccccc1[C@H](CC(O)=O)NC(=O)c1cc(=O)n([nH]1)-c1ccc(F)cc1
InChI Key: InChIKey=CFPRNMOXLMJNHF-INIZCTEOSA-N
Data: 1 IC50
Activity Spreadsheet -- Enzyme Inhibition Constant Data from BindingDB
Found 1 hit for monomerid = 50396578
Trg + Lig
Ki
nM
ΔG°
kcal/mole
IC50
nM
Kd
nM
EC50/IC50
nM
koff
s-1
kon
M-1s-1
pHTemp
°C
Cathepsin A (CTSA)
(Homo sapiens (Human))
BDBM50396578
(CHEMBL2171604)
Show SMILES Cc1ccccc1[C@H](CC(O)=O)NC(=O)c1cc(=O)n([nH]1)-c1ccc(F)cc1 |r|
Show InChI InChI=1S/C20H18FN3O4/c1-12-4-2-3-5-15(12)16(11-19(26)27)22-20(28)17-10-18(25)24(23-17)14-8-6-13(21)7-9-14/h2-10,16,23H,11H2,1H3,(H,22,28)(H,26,27)/t16-/m0/s1
n/an/a 87n/an/an/an/an/an/a
Sanofi-Aventis Deutschland GmbH
Curated by ChEMBL
Assay Description
Inhibition of human recombinant Myc-His10-tagged cathepsin A expressed in baculovirus infected Sf9 cells using BodipyFL labeled bradykinin as substra...
J Med Chem 55: 7636-49 (2012)
Article DOI: 10.1021/jm300663n
BindingDB Entry DOI: 10.7270/Q2SJ1MRZ