null
SMILES: O=S(=O)(N1CCc2ccccc2C1)c1cccc(c1)-c1nnn[nH]1
InChI Key: InChIKey=OAHSGVQFSYIBJH-UHFFFAOYSA-N
Activity Spreadsheet -- Enzyme Inhibition Constant Data from BindingDB
Found 5 hits for monomerid = 50396693
Trg + Lig
Ki
nM
ΔG°
kcal/mole
IC50
nM
Kd
nM
EC50/IC50
nM
koff
s-1
kon
M-1s-1
pHTemp
°C
Aldo-keto reductase family 1 member C3
(Homo sapiens (Human))
BDBM50396693
(CHEMBL2172067)
Show SMILES O=S(=O)(N1CCc2ccccc2C1)c1cccc(c1)-c1nnn[nH]1
Show InChI InChI=1S/C16H15N5O2S/c22-24(23,21-9-8-12-4-1-2-5-14(12)11-21)15-7-3-6-13(10-15)16-17-19-20-18-16/h1-7,10H,8-9,11H2,(H,17,18,19,20)
n/an/a 9.5n/an/an/an/an/an/a
University of Auckland
Curated by ChEMBL
Assay Description
Inhibition of human recombinant N-terminal His6-tagged AKR1C3 expressed in Escherichia coli BL21(DE3) cells using 8-Acetyl-2,3,5,6-tetrahydro-1H,4H-1...
J Med Chem 55: 7746-58 (2012)
Article DOI: 10.1021/jm3007867
BindingDB Entry DOI: 10.7270/Q28K7B6F
Aldo-keto reductase family 1 member C3
(Homo sapiens (Human))
BDBM50396693
(CHEMBL2172067)
Show SMILES O=S(=O)(N1CCc2ccccc2C1)c1cccc(c1)-c1nnn[nH]1
Show InChI InChI=1S/C16H15N5O2S/c22-24(23,21-9-8-12-4-1-2-5-14(12)11-21)15-7-3-6-13(10-15)16-17-19-20-18-16/h1-7,10H,8-9,11H2,(H,17,18,19,20)
n/an/a 897n/an/an/an/an/an/a
University of Auckland
Curated by ChEMBL
Assay Description
Inhibition of AKR1C3 overexpressed in human HCT116 cells assessed as inhibition of PR-104A conversion to hydroxylamine after 2 hrs by spectrophotomet...
J Med Chem 55: 7746-58 (2012)
Article DOI: 10.1021/jm3007867
BindingDB Entry DOI: 10.7270/Q28K7B6F
Aldo-keto reductase family 1 member C1
(Homo sapiens (Human))
BDBM50396693
(CHEMBL2172067)
Show SMILES O=S(=O)(N1CCc2ccccc2C1)c1cccc(c1)-c1nnn[nH]1
Show InChI InChI=1S/C16H15N5O2S/c22-24(23,21-9-8-12-4-1-2-5-14(12)11-21)15-7-3-6-13(10-15)16-17-19-20-18-16/h1-7,10H,8-9,11H2,(H,17,18,19,20)
Reactome pathway
n/an/a>3.00E+4n/an/an/an/an/an/a
University of Auckland
Curated by ChEMBL
Assay Description
Inhibition of human recombinant N-terminal His6-tagged AKR1C1 expressed in Escherichia coli BL21(DE3) cells using 8-Acetyl-2,3,5,6-tetrahydro-1H,4H-1...
J Med Chem 55: 7746-58 (2012)
Article DOI: 10.1021/jm3007867
BindingDB Entry DOI: 10.7270/Q28K7B6F
Aldo-keto reductase family 1 member C4
(Homo sapiens (Human))
BDBM50396693
(CHEMBL2172067)
Show SMILES O=S(=O)(N1CCc2ccccc2C1)c1cccc(c1)-c1nnn[nH]1
Show InChI InChI=1S/C16H15N5O2S/c22-24(23,21-9-8-12-4-1-2-5-14(12)11-21)15-7-3-6-13(10-15)16-17-19-20-18-16/h1-7,10H,8-9,11H2,(H,17,18,19,20)
n/an/a>3.00E+4n/an/an/an/an/an/a
University of Auckland
Curated by ChEMBL
Assay Description
Inhibition of human recombinant N-terminal His6-tagged AKR1C4 expressed in Escherichia coli BL21(DE3) cells using 8-Acetyl-2,3,5,6-tetrahydro-1H,4H-1...
J Med Chem 55: 7746-58 (2012)
Article DOI: 10.1021/jm3007867
BindingDB Entry DOI: 10.7270/Q28K7B6F
Aldo-keto reductase family 1 member C2
(Homo sapiens (Human))
BDBM50396693
(CHEMBL2172067)
Show SMILES O=S(=O)(N1CCc2ccccc2C1)c1cccc(c1)-c1nnn[nH]1
Show InChI InChI=1S/C16H15N5O2S/c22-24(23,21-9-8-12-4-1-2-5-14(12)11-21)15-7-3-6-13(10-15)16-17-19-20-18-16/h1-7,10H,8-9,11H2,(H,17,18,19,20)
Reactome pathway
n/an/a>3.00E+4n/an/an/an/an/an/a
University of Auckland
Curated by ChEMBL
Assay Description
Inhibition of human recombinant N-terminal His6-tagged AKR1C2 expressed in Escherichia coli BL21(DE3) cells using 8-Acetyl-2,3,5,6-tetrahydro-1H,4H-1...
J Med Chem 55: 7746-58 (2012)
Article DOI: 10.1021/jm3007867
BindingDB Entry DOI: 10.7270/Q28K7B6F