BDBM50396699 CHEMBL2172079
SMILES: OC(=O)C1CCN(C1)S(=O)(=O)c1ccc2ccccc2c1
InChI Key: InChIKey=PSGCTJNLVUTDIM-UHFFFAOYSA-N
Data: 6 IC50
Activity Spreadsheet -- Enzyme Inhibition Constant Data from BindingDB
Found 6 hits for monomerid = 50396699
Trg + Lig
Ki
nM
ΔG°
kcal/mole
IC50
nM
Kd
nM
EC50/IC50
nM
koff
s-1
kon
M-1s-1
pHTemp
°C
Aldo-keto reductase family 1 member C2
(Homo sapiens (Human))
BDBM50396699
(CHEMBL2172079)
Show SMILES OC(=O)C1CCN(C1)S(=O)(=O)c1ccc2ccccc2c1
Show InChI InChI=1S/C15H15NO4S/c17-15(18)13-7-8-16(10-13)21(19,20)14-6-5-11-3-1-2-4-12(11)9-14/h1-6,9,13H,7-8,10H2,(H,17,18)
Reactome pathway
n/an/a>3.00E+4n/an/an/an/an/an/a
University of Auckland
Curated by ChEMBL
Assay Description
Inhibition of human recombinant N-terminal His6-tagged AKR1C2 expressed in Escherichia coli BL21(DE3) cells using 8-Acetyl-2,3,5,6-tetrahydro-1H,4H-1...
J Med Chem 55: 7746-58 (2012)
Article DOI: 10.1021/jm3007867
BindingDB Entry DOI: 10.7270/Q28K7B6F
Aldo-keto reductase family 1 member C4 (AK1C4)
(Homo sapiens (Human))
BDBM50396699
(CHEMBL2172079)
Show SMILES OC(=O)C1CCN(C1)S(=O)(=O)c1ccc2ccccc2c1
Show InChI InChI=1S/C15H15NO4S/c17-15(18)13-7-8-16(10-13)21(19,20)14-6-5-11-3-1-2-4-12(11)9-14/h1-6,9,13H,7-8,10H2,(H,17,18)
n/an/a>3.00E+4n/an/an/an/an/an/a
University of Auckland
Curated by ChEMBL
Assay Description
Inhibition of human recombinant N-terminal His6-tagged AKR1C4 expressed in Escherichia coli BL21(DE3) cells using 8-Acetyl-2,3,5,6-tetrahydro-1H,4H-1...
J Med Chem 55: 7746-58 (2012)
Article DOI: 10.1021/jm3007867
BindingDB Entry DOI: 10.7270/Q28K7B6F
17-beta-Hydroxysteroid Dehydrogenase 5 (17-beta-HSD5, AKR1C3)
(Homo sapiens (Human))
BDBM50396699
(CHEMBL2172079)
Show SMILES OC(=O)C1CCN(C1)S(=O)(=O)c1ccc2ccccc2c1
Show InChI InChI=1S/C15H15NO4S/c17-15(18)13-7-8-16(10-13)21(19,20)14-6-5-11-3-1-2-4-12(11)9-14/h1-6,9,13H,7-8,10H2,(H,17,18)
n/an/a 380n/an/an/an/an/an/a
Guangzhou Medical University
Curated by ChEMBL
Assay Description
Inhibition of human recombinant His-tagged AKR1C3 expressed in Escherichia coli BL21 (DE3) cells using 8-Acetyl-2,3,5,6-tetrahydro-1H,4H-11-oxa-3a-az...
Bioorg Med Chem Lett 26: 5631-5638 (2016)
Article DOI: 10.1016/j.bmcl.2016.10.073
BindingDB Entry DOI: 10.7270/Q200043M
17-beta-Hydroxysteroid Dehydrogenase 5 (17-beta-HSD5, AKR1C3)
(Homo sapiens (Human))
BDBM50396699
(CHEMBL2172079)
Show SMILES OC(=O)C1CCN(C1)S(=O)(=O)c1ccc2ccccc2c1
Show InChI InChI=1S/C15H15NO4S/c17-15(18)13-7-8-16(10-13)21(19,20)14-6-5-11-3-1-2-4-12(11)9-14/h1-6,9,13H,7-8,10H2,(H,17,18)
n/an/a 380n/an/an/an/an/an/a
University of Auckland
Curated by ChEMBL
Assay Description
Inhibition of human recombinant N-terminal His6-tagged AKR1C3 expressed in Escherichia coli BL21(DE3) cells using 8-Acetyl-2,3,5,6-tetrahydro-1H,4H-1...
J Med Chem 55: 7746-58 (2012)
Article DOI: 10.1021/jm3007867
BindingDB Entry DOI: 10.7270/Q28K7B6F
Aldo-keto-reductase family 1 member C3
(Homo sapiens (Human))
BDBM50396699
(CHEMBL2172079)
Show SMILES OC(=O)C1CCN(C1)S(=O)(=O)c1ccc2ccccc2c1
Show InChI InChI=1S/C15H15NO4S/c17-15(18)13-7-8-16(10-13)21(19,20)14-6-5-11-3-1-2-4-12(11)9-14/h1-6,9,13H,7-8,10H2,(H,17,18)
n/an/a 380n/an/an/an/an/an/a
Guangzhou Medical University
Curated by ChEMBL
Assay Description
Inhibition of human recombinant His-tagged AKR1C3 expressed in Escherichia coli BL21 (DE3) cells using 8-Acetyl-2,3,5,6-tetrahydro-1H,4H-11-oxa-3a-az...
Bioorg Med Chem Lett 26: 5631-5638 (2016)
Article DOI: 10.1016/j.bmcl.2016.10.073
BindingDB Entry DOI: 10.7270/Q200043M
Aldo-keto reductase family 1 member C1
(Homo sapiens (Human))
BDBM50396699
(CHEMBL2172079)
Show SMILES OC(=O)C1CCN(C1)S(=O)(=O)c1ccc2ccccc2c1
Show InChI InChI=1S/C15H15NO4S/c17-15(18)13-7-8-16(10-13)21(19,20)14-6-5-11-3-1-2-4-12(11)9-14/h1-6,9,13H,7-8,10H2,(H,17,18)
Reactome pathway
n/an/a 2.22E+4n/an/an/an/an/an/a
University of Auckland
Curated by ChEMBL
Assay Description
Inhibition of human recombinant N-terminal His6-tagged AKR1C1 expressed in Escherichia coli BL21(DE3) cells using 8-Acetyl-2,3,5,6-tetrahydro-1H,4H-1...
J Med Chem 55: 7746-58 (2012)
Article DOI: 10.1021/jm3007867
BindingDB Entry DOI: 10.7270/Q28K7B6F