BDBM50396777 CHEMBL2172493
SMILES: CC(C)c1ccc(Cc2ccc3CO[C@]4(O[C@H](CO)[C@@H](O)[C@H](O)[C@H]4O)c3c2)cc1
InChI Key: InChIKey=QRZWBKCZAZOIRN-ZQGJOIPISA-N
Data: 2 IC50
Activity Spreadsheet -- Enzyme Inhibition Constant Data from BindingDB
Found 2 hits for monomerid = 50396777
Trg + Lig
Ki
nM
ΔG°
kcal/mole
IC50
nM
Kd
nM
EC50/IC50
nM
koff
s-1
kon
M-1s-1
pHTemp
°C
Sodium/glucose cotransporter 2
(Homo sapiens (Human))
BDBM50396777
(CHEMBL2172493)
Show SMILES CC(C)c1ccc(Cc2ccc3CO[C@]4(O[C@H](CO)[C@@H](O)[C@H](O)[C@H]4O)c3c2)cc1 |r|
Show InChI InChI=1S/C23H28O6/c1-13(2)16-6-3-14(4-7-16)9-15-5-8-17-12-28-23(18(17)10-15)22(27)21(26)20(25)19(11-24)29-23/h3-8,10,13,19-22,24-27H,9,11-12H2,1-2H3/t19-,20-,21+,22-,23+/m1/s1
n/an/a 3.20n/an/an/an/an/an/a
Chugai Pharmaceutical Co., Ltd.
Curated by ChEMBL
Assay Description
Inhibition of human SGLT2 expressed in CHO cells assessed as inhibition of sodium-dependent [14C]methyl-alpha-D-glucopyranoside uptake after 45 mins
J Med Chem 55: 7828-40 (2012)
Article DOI: 10.1021/jm300884k
BindingDB Entry DOI: 10.7270/Q2MW2J9K
Sodium/glucose cotransporter 1 (SGLT1)
(Homo sapiens (Human))
BDBM50396777
(CHEMBL2172493)
Show SMILES CC(C)c1ccc(Cc2ccc3CO[C@]4(O[C@H](CO)[C@@H](O)[C@H](O)[C@H]4O)c3c2)cc1 |r|
Show InChI InChI=1S/C23H28O6/c1-13(2)16-6-3-14(4-7-16)9-15-5-8-17-12-28-23(18(17)10-15)22(27)21(26)20(25)19(11-24)29-23/h3-8,10,13,19-22,24-27H,9,11-12H2,1-2H3/t19-,20-,21+,22-,23+/m1/s1
n/an/a 1.23E+4n/an/an/an/an/an/a
Chugai Pharmaceutical Co., Ltd.
Curated by ChEMBL
Assay Description
Inhibition of human SGLT1 expressed in CHO cells assessed as inhibition of sodium-dependent [14C]methyl-alpha-D-glucopyranoside uptake after 45 mins
J Med Chem 55: 7828-40 (2012)
Article DOI: 10.1021/jm300884k
BindingDB Entry DOI: 10.7270/Q2MW2J9K