BDBM50396972 CHEMBL2170952
SMILES: Cc1cnc2nnn(Cc3ccc4ncccc4c3)c2n1
InChI Key: InChIKey=WJNDOCURIXGUPV-UHFFFAOYSA-N
Data: 1 KI  1 IC50
Activity Spreadsheet -- Enzyme Inhibition Constant Data from BindingDB
Found 2 hits for monomerid = 50396972
Trg + Lig
Ki
nM
ΔG°
kcal/mole
IC50
nM
Kd
nM
EC50/IC50
nM
koff
s-1
kon
M-1s-1
pHTemp
°C
Hepatocyte growth factor receptor
(Homo sapiens (Human))
BDBM50396972
(CHEMBL2170952)
Show SMILES Cc1cnc2nnn(Cc3ccc4ncccc4c3)c2n1
Show InChI InChI=1S/C15H12N6/c1-10-8-17-14-15(18-10)21(20-19-14)9-11-4-5-13-12(7-11)3-2-6-16-13/h2-8H,9H2,1H3
34n/an/an/an/an/an/an/an/a
Pfizer Inc.
Curated by ChEMBL
Assay Description
Competitive inhibition of N-terminal His6-tagged recombinant human c-MET (974 to 1390 amino acids) by spectrophotometry
J Med Chem 55: 8091-109 (2012)
Article DOI: 10.1021/jm300967g
BindingDB Entry DOI: 10.7270/Q2Z60Q59
Hepatocyte growth factor receptor
(Homo sapiens (Human))
BDBM50396972
(CHEMBL2170952)
Show SMILES Cc1cnc2nnn(Cc3ccc4ncccc4c3)c2n1
Show InChI InChI=1S/C15H12N6/c1-10-8-17-14-15(18-10)21(20-19-14)9-11-4-5-13-12(7-11)3-2-6-16-13/h2-8H,9H2,1H3
n/an/a 82n/an/an/an/an/an/a
Pfizer Inc.
Curated by ChEMBL
Assay Description
Antagonist activity at c-MET receptor in human A549 cells assessed as inhibition of autophosphorylation after 1 hr by ELISA
J Med Chem 55: 8091-109 (2012)
Article DOI: 10.1021/jm300967g
BindingDB Entry DOI: 10.7270/Q2Z60Q59