BDBM50397071 CHEMBL2171425
SMILES: COc1cc(ccc1-c1nc2c(C)nn(C3CCCCC3)c(=O)c2[nH]1)N1CC[C@H](N)C1
InChI Key: InChIKey=LHZWBPTXJAFTCG-HNNXBMFYSA-N
Data: 1 IC50
Activity Spreadsheet -- Enzyme Inhibition Constant Data from BindingDB
Found 1 hit for monomerid = 50397071
Trg + Lig
Ki
nM
ΔG°
kcal/mole
IC50
nM
Kd
nM
EC50/IC50
nM
koff
s-1
kon
M-1s-1
pHTemp
°C
Phosphodiesterase 7
(Homo sapiens (Human))
BDBM50397071
(CHEMBL2171425)
Show SMILES COc1cc(ccc1-c1nc2c(C)nn(C3CCCCC3)c(=O)c2[nH]1)N1CC[C@H](N)C1 |r|
Show InChI InChI=1S/C23H30N6O2/c1-14-20-21(23(30)29(27-14)16-6-4-3-5-7-16)26-22(25-20)18-9-8-17(12-19(18)31-2)28-11-10-15(24)13-28/h8-9,12,15-16H,3-7,10-11,13,24H2,1-2H3,(H,25,26)/t15-/m0/s1
Reactome pathway
n/an/a 80n/an/an/an/an/an/a
Glenmark Pharmaceuticals Limited
Curated by ChEMBL
Assay Description
Inhibition of cloned human recombinant PDE7A assessed as [3H]cAMP hydrolysis by radiometric assay
Bioorg Med Chem Lett 22: 6286-91 (2012)
Article DOI: 10.1016/j.bmcl.2012.07.077
BindingDB Entry DOI: 10.7270/Q21Z45JB