BDBM50397082 CHEMBL2171460
SMILES: COc1ccc(cc1OCc1cccc2ccccc12)C1=NN(C2CCCCCC2)C(=O)C1(C)C
InChI Key: InChIKey=GKAMKMFKRFIGHU-UHFFFAOYSA-N
Data: 1 IC50
Activity Spreadsheet -- Enzyme Inhibition Constant Data from BindingDB
Found 1 hit for monomerid = 50397082
Trg + Lig
Ki
nM
ΔG°
kcal/mole
IC50
nM
Kd
nM
EC50/IC50
nM
koff
s-1
kon
M-1s-1
pHTemp
°C
Class I phosphodiesterase B1 (TbrPDEB1)
(Trypanosoma brucei)
BDBM50397082
(CHEMBL2171460)
Show SMILES COc1ccc(cc1OCc1cccc2ccccc12)C1=NN(C2CCCCCC2)C(=O)C1(C)C |t:23|
Show InChI InChI=1S/C30H34N2O3/c1-30(2)28(31-32(29(30)33)24-14-6-4-5-7-15-24)22-17-18-26(34-3)27(19-22)35-20-23-13-10-12-21-11-8-9-16-25(21)23/h8-13,16-19,24H,4-7,14-15,20H2,1-3H3
n/an/a 250n/an/an/an/an/an/a
VU University Amsterdam
Curated by ChEMBL
Assay Description
Inhibition of Trypanosoma brucei recombinant TbrPDEB1 expressed in Sf21 insect cells assessed as reduction of [3H]-cAMP hydrolysis by scintillation p...
J Med Chem 55: 8745-56 (2012)
Article DOI: 10.1021/jm301059b
BindingDB Entry DOI: 10.7270/Q2SF2X96