BDBM50397097 CHEMBL2171651
SMILES: COc1ccc(cc1Cl)C1=NN(C2CCCCCC2)C(=O)C1(C)C
InChI Key: InChIKey=ZNQLOQWZRCBKSX-UHFFFAOYSA-N
Data: 1 IC50
Activity Spreadsheet -- Enzyme Inhibition Constant Data from BindingDB
Found 1 hit for monomerid = 50397097
Trg + Lig
Ki
nM
ΔG°
kcal/mole
IC50
nM
Kd
nM
EC50/IC50
nM
koff
s-1
kon
M-1s-1
pHTemp
°C
Class I phosphodiesterase B1 (TbrPDEB1)
(Trypanosoma brucei)
BDBM50397097
(CHEMBL2171651)
Show SMILES COc1ccc(cc1Cl)C1=NN(C2CCCCCC2)C(=O)C1(C)C |t:10|
Show InChI InChI=1S/C19H25ClN2O2/c1-19(2)17(13-10-11-16(24-3)15(20)12-13)21-22(18(19)23)14-8-6-4-5-7-9-14/h10-12,14H,4-9H2,1-3H3
n/an/a 2.00E+3n/an/an/an/an/an/a
VU University Amsterdam
Curated by ChEMBL
Assay Description
Inhibition of Trypanosoma brucei recombinant TbrPDEB1 expressed in Sf21 insect cells assessed as reduction of [3H]-cAMP hydrolysis by scintillation p...
J Med Chem 55: 8745-56 (2012)
Article DOI: 10.1021/jm301059b
BindingDB Entry DOI: 10.7270/Q2SF2X96