BDBM50397118 CHEMBL2171985
SMILES: Cc1ccc(cc1)N1CCN(CC1)C(=O)[C@@H]1CCCC[C@H]1C(=O)NCC#N
InChI Key: InChIKey=QONCHQJAALKJOG-RTBURBONSA-N
Data: 3 IC50
Activity Spreadsheet -- Enzyme Inhibition Constant Data from BindingDB
Found 3 hits for monomerid = 50397118
Trg + Lig
Ki
nM
ΔG°
kcal/mole
IC50
nM
Kd
nM
EC50/IC50
nM
koff
s-1
kon
M-1s-1
pHTemp
°C
Procathepsin L
(Homo sapiens (Human))
BDBM50397118
(CHEMBL2171985)
Show SMILES Cc1ccc(cc1)N1CCN(CC1)C(=O)[C@@H]1CCCC[C@H]1C(=O)NCC#N |r|
Show InChI InChI=1S/C21H28N4O2/c1-16-6-8-17(9-7-16)24-12-14-25(15-13-24)21(27)19-5-3-2-4-18(19)20(26)23-11-10-22/h6-9,18-19H,2-5,11-15H2,1H3,(H,23,26)/t18-,19-/m1/s1
Reactome pathway
n/an/a>1.00E+4n/an/an/an/an/an/a
AstraZeneca
Curated by ChEMBL
Assay Description
Inhibition of human recombinant cathepsin-L using Z-Phe-Arg-AMC as substrate preincubated for 15 mins measured after 1 hr by QFRET assay
J Med Chem 55: 8827-37 (2012)
Article DOI: 10.1021/jm301119s
BindingDB Entry DOI: 10.7270/Q2HX1DS7
Cathepsin B
(Homo sapiens (Human))
BDBM50397118
(CHEMBL2171985)
Show SMILES Cc1ccc(cc1)N1CCN(CC1)C(=O)[C@@H]1CCCC[C@H]1C(=O)NCC#N |r|
Show InChI InChI=1S/C21H28N4O2/c1-16-6-8-17(9-7-16)24-12-14-25(15-13-24)21(27)19-5-3-2-4-18(19)20(26)23-11-10-22/h6-9,18-19H,2-5,11-15H2,1H3,(H,23,26)/t18-,19-/m1/s1
Reactome pathway
n/an/a 572n/an/an/an/an/an/a
AstraZeneca
Curated by ChEMBL
Assay Description
Inhibition of human recombinant cathepsin-B using Z-Arg-Arg-AMC as substrate preincubated for 15 mins measured after 1 hr by QFRET assay
J Med Chem 55: 8827-37 (2012)
Article DOI: 10.1021/jm301119s
BindingDB Entry DOI: 10.7270/Q2HX1DS7
Cathepsin K
(Homo sapiens (Human))
BDBM50397118
(CHEMBL2171985)
Show SMILES Cc1ccc(cc1)N1CCN(CC1)C(=O)[C@@H]1CCCC[C@H]1C(=O)NCC#N |r|
Show InChI InChI=1S/C21H28N4O2/c1-16-6-8-17(9-7-16)24-12-14-25(15-13-24)21(27)19-5-3-2-4-18(19)20(26)23-11-10-22/h6-9,18-19H,2-5,11-15H2,1H3,(H,23,26)/t18-,19-/m1/s1
Reactome pathway
n/an/a 11n/an/an/an/an/an/a
AstraZeneca
Curated by ChEMBL
Assay Description
Inhibition of human recombinant cathepsin-k using Z-Phe-Arg-AMC as substrate preincubated for 15 mins measured after 1 hr by QFRET assay
J Med Chem 55: 8827-37 (2012)
Article DOI: 10.1021/jm301119s
BindingDB Entry DOI: 10.7270/Q2HX1DS7