BDBM50397366 CHEMBL2170167
SMILES: COC(=O)CCCCCCC(=O)Nc1ccc(OCc2cc(CN=[N+]=[N-])cc(c2)N=[N+]=[N-])cc1
InChI Key: InChIKey=OMRPSJCQMWFTDD-UHFFFAOYSA-N
Data: 1 IC50
Activity Spreadsheet -- Enzyme Inhibition Constant Data from BindingDB
Found 1 hit for monomerid = 50397366
Trg + Lig
Ki
nM
ΔG°
kcal/mole
IC50
nM
Kd
nM
EC50/IC50
nM
koff
s-1
kon
M-1s-1
pHTemp
°C
Histone deacetylase 8
(Homo sapiens (Human))
BDBM50397366
(CHEMBL2170167)
Show SMILES COC(=O)CCCCCCC(=O)Nc1ccc(OCc2cc(CN=[N+]=[N-])cc(c2)N=[N+]=[N-])cc1
Show InChI InChI=1S/C23H27N7O4/c1-33-23(32)7-5-3-2-4-6-22(31)27-19-8-10-21(11-9-19)34-16-18-12-17(15-26-29-24)13-20(14-18)28-30-25/h8-14H,2-7,15-16H2,1H3,(H,27,31)
NCI pathway
Reactome pathway
n/an/a 3.74E+4n/an/an/an/an/an/a
University of Illinois at Chicago
Curated by ChEMBL
Assay Description
Inhibition of human recombinant HDAC8 using fluor de Lys as substrate preincubated for 5 mins followed by substrate addition measured after 25 mins b...
Bioorg Med Chem Lett 22: 6621-7 (2012)
Article DOI: 10.1016/j.bmcl.2012.08.104
BindingDB Entry DOI: 10.7270/Q2GX4CQR