BDBM50397451 CHEMBL2170736
SMILES: CC(CNCc1ccc(O)cc1)[C@H]1CCC2=Cc3c(O[C@H]2C1)cc(C)oc3=O
InChI Key: InChIKey=FJWUSMYDQXICMB-FKQPOWTQSA-N
Data: 1 IC50
Activity Spreadsheet -- Enzyme Inhibition Constant Data from BindingDB
Found 1 hit for monomerid = 50397451
Trg + Lig
Ki
nM
ΔG°
kcal/mole
IC50
nM
Kd
nM
EC50/IC50
nM
koff
s-1
kon
M-1s-1
pHTemp
°C
Sterol O-acyltransferase 1
(Homo sapiens (Human))
BDBM50397451
(CHEMBL2170736)
Show SMILES CC(CNCc1ccc(O)cc1)[C@H]1CCC2=Cc3c(O[C@H]2C1)cc(C)oc3=O |r,t:16|
Show InChI InChI=1S/C23H27NO4/c1-14(12-24-13-16-3-7-19(25)8-4-16)17-5-6-18-10-20-22(28-21(18)11-17)9-15(2)27-23(20)26/h3-4,7-10,14,17,21,24-25H,5-6,11-13H2,1-2H3/t14?,17-,21-/m0/s1
n/an/a 300n/an/an/an/an/an/a
Kansas State University
Curated by ChEMBL
Assay Description
Inhibition of ACAT activity in human MC65 cells using NBD-cholesterol staining after 48 hrs by fluorescence assay
J Med Chem 55: 8969-73 (2012)
Article DOI: 10.1021/jm3012189
BindingDB Entry DOI: 10.7270/Q2000370