BDBM50398036 CHEMBL1317546
SMILES: CC(=O)c1ccc(cc1O)N1CCOCC1
InChI Key: InChIKey=YHKSBKQXCWHTQL-UHFFFAOYSA-N
Data: 2 IC50
Activity Spreadsheet -- Enzyme Inhibition Constant Data from BindingDB
Found 2 hits for monomerid = 50398036
Trg + Lig
Ki
nM
ΔG°
kcal/mole
IC50
nM
Kd
nM
EC50/IC50
nM
koff
s-1
kon
M-1s-1
pHTemp
°C
DNA-dependent protein kinase (DNAPK)
(Mus musculus (Mouse))
BDBM50398036
(CHEMBL1317546)
Show SMILES CC(=O)c1ccc(cc1O)N1CCOCC1
Show InChI InChI=1S/C12H15NO3/c1-9(14)11-3-2-10(8-12(11)15)13-4-6-16-7-5-13/h2-3,8,15H,4-7H2,1H3
n/an/a 120n/an/an/an/an/an/a
AstraZeneca
Curated by ChEMBL
Assay Description
Inhibition of DNA-PK in C57BL6 mouse endothelial cells
Bioorg Med Chem Lett 22: 5352-9 (2012)
Article DOI: 10.1016/j.bmcl.2012.06.053
BindingDB Entry DOI: 10.7270/Q23J3F2G
DNA-dependent protein kinase catalytic subunit
(Homo sapiens (Human))
BDBM50398036
(CHEMBL1317546)
Show SMILES CC(=O)c1ccc(cc1O)N1CCOCC1
Show InChI InChI=1S/C12H15NO3/c1-9(14)11-3-2-10(8-12(11)15)13-4-6-16-7-5-13/h2-3,8,15H,4-7H2,1H3
n/an/a 120n/an/an/an/an/an/a
University Hospital Hradec Kralove
Curated by ChEMBL
Assay Description
Inhibition of DNA-PK purified from HeLa nuclear extracts assessed as EPPLSQEAFADLWKKR peptide substrate phosphorylation
J Med Chem 58: 41-71 (2015)
Article DOI: 10.1021/jm501026z
BindingDB Entry DOI: 10.7270/Q2P84DJ7