BDBM50398456 CHEMBL2179119
SMILES: Oc1ccc(cc1)-c1nc(c([nH]1)-c1ccc(F)cc1)-c1ccnc2[nH]c(cc12)-c1ccccc1
InChI Key: InChIKey=HFDJAPMETZJFMI-UHFFFAOYSA-N
Data: 2 IC50
Activity Spreadsheet -- Enzyme Inhibition Constant Data from BindingDB
Found 2 hits for monomerid = 50398456
Trg + Lig
Ki
nM
ΔG°
kcal/mole
IC50
nM
Kd
nM
EC50/IC50
nM
koff
s-1
kon
M-1s-1
pHTemp
°C
Epidermal growth factor receptor
(Homo sapiens (Human))
BDBM50398456
(CHEMBL2179119)
Show SMILES Oc1ccc(cc1)-c1nc(c([nH]1)-c1ccc(F)cc1)-c1ccnc2[nH]c(cc12)-c1ccccc1
Show InChI InChI=1S/C28H19FN4O/c29-20-10-6-18(7-11-20)25-26(33-27(32-25)19-8-12-21(34)13-9-19)22-14-15-30-28-23(22)16-24(31-28)17-4-2-1-3-5-17/h1-16,34H,(H,30,31)(H,32,33)
n/an/a 49n/an/an/an/an/an/a
Eberhard Karls Universit£t T£bingen
Curated by ChEMBL
Assay Description
Inhibition of recombinant human GST-tagged wild type EGFR ( 668 to 1210 residues) cytoplasmic domain expressed in baculovirus expression system prein...
J Med Chem 60: 4636-4656 (2017)
Article DOI: 10.1021/acs.jmedchem.7b00178
BindingDB Entry DOI: 10.7270/Q26T0Q47
Mitogen-activated protein kinase 14
(Homo sapiens (Human))
BDBM50398456
(CHEMBL2179119)
Show SMILES Oc1ccc(cc1)-c1nc(c([nH]1)-c1ccc(F)cc1)-c1ccnc2[nH]c(cc12)-c1ccccc1
Show InChI InChI=1S/C28H19FN4O/c29-20-10-6-18(7-11-20)25-26(33-27(32-25)19-8-12-21(34)13-9-19)22-14-15-30-28-23(22)16-24(31-28)17-4-2-1-3-5-17/h1-16,34H,(H,30,31)(H,32,33)
NCI pathway
Reactome pathway
n/an/a 3n/an/an/an/an/an/a
University of Tuebingen
Curated by ChEMBL
Assay Description
Inhibition of p38alpha MAPK
J Med Chem 55: 8429-39 (2012)
Article DOI: 10.1021/jm300852w
BindingDB Entry DOI: 10.7270/Q2765GGT