BDBM50398464 CHEMBL2179115
SMILES: Fc1ccc(cc1)-c1[nH]c(nc1-c1ccnc2[nH]c(cc12)C1CCCCC1)-c1ccccc1
InChI Key: InChIKey=DNKAGWPFLKTMAE-UHFFFAOYSA-N
Data: 1 IC50
Activity Spreadsheet -- Enzyme Inhibition Constant Data from BindingDB
Found 1 hit for monomerid = 50398464
Trg + Lig
Ki
nM
ΔG°
kcal/mole
IC50
nM
Kd
nM
EC50/IC50
nM
koff
s-1
kon
M-1s-1
pHTemp
°C
Mitogen-activated protein kinase 14
(Homo sapiens (Human))
BDBM50398464
(CHEMBL2179115)
Show SMILES Fc1ccc(cc1)-c1[nH]c(nc1-c1ccnc2[nH]c(cc12)C1CCCCC1)-c1ccccc1
Show InChI InChI=1S/C28H25FN4/c29-21-13-11-19(12-14-21)25-26(33-27(32-25)20-9-5-2-6-10-20)22-15-16-30-28-23(22)17-24(31-28)18-7-3-1-4-8-18/h2,5-6,9-18H,1,3-4,7-8H2,(H,30,31)(H,32,33)
NCI pathway
Reactome pathway
n/an/a 15n/an/an/an/an/an/a
University of Tuebingen
Curated by ChEMBL
Assay Description
Inhibition of p38alpha MAPK
J Med Chem 55: 8429-39 (2012)
Article DOI: 10.1021/jm300852w
BindingDB Entry DOI: 10.7270/Q2765GGT