BDBM50398487 CHEMBL2177437
SMILES: CC(C(=O)NCc1ccc(nc1N1CCC(=CC1)c1ccccc1)C(F)(F)F)c1ccc(NS(C)(=O)=O)c(F)c1
InChI Key: InChIKey=OTSNSLYMBVCSBZ-UHFFFAOYSA-N
Data: 1 KI  1 IC50
Activity Spreadsheet -- Enzyme Inhibition Constant Data from BindingDB
Found 2 hits for monomerid = 50398487
Trg + Lig
Ki
nM
ΔG°
kcal/mole
IC50
nM
Kd
nM
EC50/IC50
nM
koff
s-1
kon
M-1s-1
pHTemp
°C
Transient receptor potential cation channel subfamily V member 1
(Homo sapiens (Human))
BDBM50398487
(CHEMBL2177437)
Show SMILES CC(C(=O)NCc1ccc(nc1N1CCC(=CC1)c1ccccc1)C(F)(F)F)c1ccc(NS(C)(=O)=O)c(F)c1 |c:16|
Show InChI InChI=1S/C28H28F4N4O3S/c1-18(21-8-10-24(23(29)16-21)35-40(2,38)39)27(37)33-17-22-9-11-25(28(30,31)32)34-26(22)36-14-12-20(13-15-36)19-6-4-3-5-7-19/h3-12,16,18,35H,13-15,17H2,1-2H3,(H,33,37)
Reactome pathway
1.70n/an/an/an/an/an/an/an/a
Seoul National University
Curated by ChEMBL
Assay Description
Antagonist activity at human TRPV1 expressed in CHOK1 cells assessed as inhibition of capsaicin-induced activity by FLIPR assay
J Med Chem 55: 8392-408 (2012)
Article DOI: 10.1021/jm300780p
BindingDB Entry DOI: 10.7270/Q2TX3GH1
Transient receptor potential cation channel subfamily V member 1
(Homo sapiens (Human))
BDBM50398487
(CHEMBL2177437)
Show SMILES CC(C(=O)NCc1ccc(nc1N1CCC(=CC1)c1ccccc1)C(F)(F)F)c1ccc(NS(C)(=O)=O)c(F)c1 |c:16|
Show InChI InChI=1S/C28H28F4N4O3S/c1-18(21-8-10-24(23(29)16-21)35-40(2,38)39)27(37)33-17-22-9-11-25(28(30,31)32)34-26(22)36-14-12-20(13-15-36)19-6-4-3-5-7-19/h3-12,16,18,35H,13-15,17H2,1-2H3,(H,33,37)
Reactome pathway
n/an/a 43n/an/an/an/an/an/a
Seoul National University
Curated by ChEMBL
Assay Description
Antagonist activity at human TRPV1 expressed in CHOK1 cells assessed as inhibition of pH-induced activity by FLIPR assay
J Med Chem 55: 8392-408 (2012)
Article DOI: 10.1021/jm300780p
BindingDB Entry DOI: 10.7270/Q2TX3GH1