BDBM50398551 CHEMBL2177402
SMILES: CC(C(=O)NCc1ccc(nc1N1CCC(Cc2cc(F)cc(F)c2)CC1)C(F)(F)F)c1ccc(NS(C)(=O)=O)c(F)c1
InChI Key: InChIKey=DKCNQAVAFXNUSX-UHFFFAOYSA-N
Data: 1 KI  1 IC50
Activity Spreadsheet -- Enzyme Inhibition Constant Data from BindingDB
Found 2 hits for monomerid = 50398551
Trg + Lig
Ki
nM
ΔG°
kcal/mole
IC50
nM
Kd
nM
EC50/IC50
nM
koff
s-1
kon
M-1s-1
pHTemp
°C
Transient receptor potential cation channel subfamily V member 1
(Homo sapiens (Human))
BDBM50398551
(CHEMBL2177402)
Show SMILES CC(C(=O)NCc1ccc(nc1N1CCC(Cc2cc(F)cc(F)c2)CC1)C(F)(F)F)c1ccc(NS(C)(=O)=O)c(F)c1
Show InChI InChI=1S/C29H30F6N4O3S/c1-17(20-3-5-25(24(32)14-20)38-43(2,41)42)28(40)36-16-21-4-6-26(29(33,34)35)37-27(21)39-9-7-18(8-10-39)11-19-12-22(30)15-23(31)13-19/h3-6,12-15,17-18,38H,7-11,16H2,1-2H3,(H,36,40)
Reactome pathway
0.400n/an/an/an/an/an/an/an/a
Seoul National University
Curated by ChEMBL
Assay Description
Antagonist activity at human TRPV1 expressed in CHOK1 cells assessed as inhibition of capsaicin-induced activity by FLIPR assay
J Med Chem 55: 8392-408 (2012)
Article DOI: 10.1021/jm300780p
BindingDB Entry DOI: 10.7270/Q2TX3GH1
Transient receptor potential cation channel subfamily V member 1
(Homo sapiens (Human))
BDBM50398551
(CHEMBL2177402)
Show SMILES CC(C(=O)NCc1ccc(nc1N1CCC(Cc2cc(F)cc(F)c2)CC1)C(F)(F)F)c1ccc(NS(C)(=O)=O)c(F)c1
Show InChI InChI=1S/C29H30F6N4O3S/c1-17(20-3-5-25(24(32)14-20)38-43(2,41)42)28(40)36-16-21-4-6-26(29(33,34)35)37-27(21)39-9-7-18(8-10-39)11-19-12-22(30)15-23(31)13-19/h3-6,12-15,17-18,38H,7-11,16H2,1-2H3,(H,36,40)
Reactome pathway
n/an/a 24n/an/an/an/an/an/a
Seoul National University
Curated by ChEMBL
Assay Description
Antagonist activity at human TRPV1 expressed in CHOK1 cells assessed as inhibition of pH-induced activity by FLIPR assay
J Med Chem 55: 8392-408 (2012)
Article DOI: 10.1021/jm300780p
BindingDB Entry DOI: 10.7270/Q2TX3GH1