BDBM50398588 CHEMBL2179582
SMILES: CC1(C)C(=O)N(C(=O)NCC2CCN(CC3(O)CCOCC3)CC2)c2cc(F)ccc12
InChI Key: InChIKey=AGMOFKKOVMRGAK-UHFFFAOYSA-N
Data: 5 KI  7 EC50
Activity Spreadsheet -- Enzyme Inhibition Constant Data from BindingDB
Found 12 hits for monomerid = 50398588
Trg + Lig
Ki
nM
ΔG°
kcal/mole
IC50
nM
Kd
nM
EC50/IC50
nM
koff
s-1
kon
M-1s-1
pHTemp
°C
5-hydroxytryptamine receptor 4 (5-HT4)
(Homo sapiens (Human))
BDBM50398588
(CHEMBL2179582)
Show SMILES CC1(C)C(=O)N(C(=O)NCC2CCN(CC3(O)CCOCC3)CC2)c2cc(F)ccc12
Show InChI InChI=1S/C23H32FN3O4/c1-22(2)18-4-3-17(24)13-19(18)27(20(22)28)21(29)25-14-16-5-9-26(10-6-16)15-23(30)7-11-31-12-8-23/h3-4,13,16,30H,5-12,14-15H2,1-2H3,(H,25,29)
2.70n/an/an/an/an/an/an/an/a
Pfizer Inc.
Curated by ChEMBL
Assay Description
Displacement of [3H]GR113808 from human 5HT4D receptor expressed in HEK293 cells after 30 mins by liquid scintillation counting
J Med Chem 55: 9240-54 (2012)
Article DOI: 10.1021/jm300953p
BindingDB Entry DOI: 10.7270/Q2FQ9XRB
HTR4
(RAT)
BDBM50398588
(CHEMBL2179582)
Show SMILES CC1(C)C(=O)N(C(=O)NCC2CCN(CC3(O)CCOCC3)CC2)c2cc(F)ccc12
Show InChI InChI=1S/C23H32FN3O4/c1-22(2)18-4-3-17(24)13-19(18)27(20(22)28)21(29)25-14-16-5-9-26(10-6-16)15-23(30)7-11-31-12-8-23/h3-4,13,16,30H,5-12,14-15H2,1-2H3,(H,25,29)
3.90n/an/an/an/an/an/an/an/a
Pfizer Inc.
Curated by ChEMBL
Assay Description
Displacement of [3H]GR113808 from 5HT4 receptor in rat striatal membrane after 30 mins by liquid scintillation counting
J Med Chem 55: 9240-54 (2012)
Article DOI: 10.1021/jm300953p
BindingDB Entry DOI: 10.7270/Q2FQ9XRB
5-hydroxytryptamine receptor 4 (5-HT4)
(Homo sapiens (Human))
BDBM50398588
(CHEMBL2179582)
Show SMILES CC1(C)C(=O)N(C(=O)NCC2CCN(CC3(O)CCOCC3)CC2)c2cc(F)ccc12
Show InChI InChI=1S/C23H32FN3O4/c1-22(2)18-4-3-17(24)13-19(18)27(20(22)28)21(29)25-14-16-5-9-26(10-6-16)15-23(30)7-11-31-12-8-23/h3-4,13,16,30H,5-12,14-15H2,1-2H3,(H,25,29)
4.60n/an/an/an/an/an/an/an/a
Pfizer Inc.
Curated by ChEMBL
Assay Description
Displacement of [3H]GR113808 from human 5HT4A receptor expressed in HEK293 cells after 30 mins by liquid scintillation counting
J Med Chem 55: 9240-54 (2012)
Article DOI: 10.1021/jm300953p
BindingDB Entry DOI: 10.7270/Q2FQ9XRB
5-hydroxytryptamine receptor 4 (5-HT4)
(Homo sapiens (Human))
BDBM50398588
(CHEMBL2179582)
Show SMILES CC1(C)C(=O)N(C(=O)NCC2CCN(CC3(O)CCOCC3)CC2)c2cc(F)ccc12
Show InChI InChI=1S/C23H32FN3O4/c1-22(2)18-4-3-17(24)13-19(18)27(20(22)28)21(29)25-14-16-5-9-26(10-6-16)15-23(30)7-11-31-12-8-23/h3-4,13,16,30H,5-12,14-15H2,1-2H3,(H,25,29)
6.30n/an/an/an/an/an/an/an/a
Pfizer Inc.
Curated by ChEMBL
Assay Description
Displacement of [3H]GR113808 from human 5HT4E receptor expressed in CHO cells after 30 mins by liquid scintillation counting
J Med Chem 55: 9240-54 (2012)
Article DOI: 10.1021/jm300953p
BindingDB Entry DOI: 10.7270/Q2FQ9XRB
5-hydroxytryptamine receptor 4 (5-HT4)
(Homo sapiens (Human))
BDBM50398588
(CHEMBL2179582)
Show SMILES CC1(C)C(=O)N(C(=O)NCC2CCN(CC3(O)CCOCC3)CC2)c2cc(F)ccc12
Show InChI InChI=1S/C23H32FN3O4/c1-22(2)18-4-3-17(24)13-19(18)27(20(22)28)21(29)25-14-16-5-9-26(10-6-16)15-23(30)7-11-31-12-8-23/h3-4,13,16,30H,5-12,14-15H2,1-2H3,(H,25,29)
6.80n/an/an/an/an/an/an/an/a
Pfizer Inc.
Curated by ChEMBL
Assay Description
Displacement of [3H]GR113808 from human 5HT4B receptor expressed in HEK293 cells after 30 mins by liquid scintillation counting
J Med Chem 55: 9240-54 (2012)
Article DOI: 10.1021/jm300953p
BindingDB Entry DOI: 10.7270/Q2FQ9XRB
5-hydroxytryptamine receptor 4 (5-HT4)
(Homo sapiens (Human))
BDBM50398588
(CHEMBL2179582)
Show SMILES CC1(C)C(=O)N(C(=O)NCC2CCN(CC3(O)CCOCC3)CC2)c2cc(F)ccc12
Show InChI InChI=1S/C23H32FN3O4/c1-22(2)18-4-3-17(24)13-19(18)27(20(22)28)21(29)25-14-16-5-9-26(10-6-16)15-23(30)7-11-31-12-8-23/h3-4,13,16,30H,5-12,14-15H2,1-2H3,(H,25,29)
n/an/an/an/a 0.900n/an/an/an/a
Pfizer Inc.
Curated by ChEMBL
Assay Description
Agonist activity at human 5HT4D receptor expressed in HEK293 cells assessed as cAMP production after 30 mins by HTRF assay
J Med Chem 55: 9240-54 (2012)
Article DOI: 10.1021/jm300953p
BindingDB Entry DOI: 10.7270/Q2FQ9XRB
5-hydroxytryptamine receptor 4 (5-HT4)
(Homo sapiens (Human))
BDBM50398588
(CHEMBL2179582)
Show SMILES CC1(C)C(=O)N(C(=O)NCC2CCN(CC3(O)CCOCC3)CC2)c2cc(F)ccc12
Show InChI InChI=1S/C23H32FN3O4/c1-22(2)18-4-3-17(24)13-19(18)27(20(22)28)21(29)25-14-16-5-9-26(10-6-16)15-23(30)7-11-31-12-8-23/h3-4,13,16,30H,5-12,14-15H2,1-2H3,(H,25,29)
n/an/an/an/a 1.20n/an/an/an/a
Pfizer Inc.
Curated by ChEMBL
Assay Description
Agonist activity at human 5HT4E receptor expressed in HEK293 cells assessed as increase in cAMP production after 30 mins by HTRF assay
J Med Chem 55: 9240-54 (2012)
Article DOI: 10.1021/jm300953p
BindingDB Entry DOI: 10.7270/Q2FQ9XRB
HTR4
(RAT)
BDBM50398588
(CHEMBL2179582)
Show SMILES CC1(C)C(=O)N(C(=O)NCC2CCN(CC3(O)CCOCC3)CC2)c2cc(F)ccc12
Show InChI InChI=1S/C23H32FN3O4/c1-22(2)18-4-3-17(24)13-19(18)27(20(22)28)21(29)25-14-16-5-9-26(10-6-16)15-23(30)7-11-31-12-8-23/h3-4,13,16,30H,5-12,14-15H2,1-2H3,(H,25,29)
n/an/an/an/a 2.20n/an/an/an/a
Pfizer Inc.
Curated by ChEMBL
Assay Description
Agonist activity at rat 5HT4E receptor expressed in HEK293 cells assessed as increase in cAMP production after 30 mins by HTRF assay
J Med Chem 55: 9240-54 (2012)
Article DOI: 10.1021/jm300953p
BindingDB Entry DOI: 10.7270/Q2FQ9XRB
HTR4
(RAT)
BDBM50398588
(CHEMBL2179582)
Show SMILES CC1(C)C(=O)N(C(=O)NCC2CCN(CC3(O)CCOCC3)CC2)c2cc(F)ccc12
Show InChI InChI=1S/C23H32FN3O4/c1-22(2)18-4-3-17(24)13-19(18)27(20(22)28)21(29)25-14-16-5-9-26(10-6-16)15-23(30)7-11-31-12-8-23/h3-4,13,16,30H,5-12,14-15H2,1-2H3,(H,25,29)
n/an/an/an/a 1.20n/an/an/an/a
Pfizer Inc.
Curated by ChEMBL
Assay Description
Agonist activity at rat 5HT4S receptor expressed in HEK293 cells assessed as increase in cAMP production after 30 mins by HTRF assay
J Med Chem 55: 9240-54 (2012)
Article DOI: 10.1021/jm300953p
BindingDB Entry DOI: 10.7270/Q2FQ9XRB
5-hydroxytryptamine receptor 4 (5-HT4)
(Homo sapiens (Human))
BDBM50398588
(CHEMBL2179582)
Show SMILES CC1(C)C(=O)N(C(=O)NCC2CCN(CC3(O)CCOCC3)CC2)c2cc(F)ccc12
Show InChI InChI=1S/C23H32FN3O4/c1-22(2)18-4-3-17(24)13-19(18)27(20(22)28)21(29)25-14-16-5-9-26(10-6-16)15-23(30)7-11-31-12-8-23/h3-4,13,16,30H,5-12,14-15H2,1-2H3,(H,25,29)
n/an/an/an/a 0.800n/an/an/an/a
Pfizer Inc.
Curated by ChEMBL
Assay Description
Agonist activity at human 5HT4A receptor expressed in HEK293 cells assessed as increase in cAMP production after 30 mins by HTRF assay
J Med Chem 55: 9240-54 (2012)
Article DOI: 10.1021/jm300953p
BindingDB Entry DOI: 10.7270/Q2FQ9XRB
HTR4
(RAT)
BDBM50398588
(CHEMBL2179582)
Show SMILES CC1(C)C(=O)N(C(=O)NCC2CCN(CC3(O)CCOCC3)CC2)c2cc(F)ccc12
Show InChI InChI=1S/C23H32FN3O4/c1-22(2)18-4-3-17(24)13-19(18)27(20(22)28)21(29)25-14-16-5-9-26(10-6-16)15-23(30)7-11-31-12-8-23/h3-4,13,16,30H,5-12,14-15H2,1-2H3,(H,25,29)
n/an/an/an/a 1.5n/an/an/an/a
Pfizer Inc.
Curated by ChEMBL
Assay Description
Agonist activity at rat 5HT4L receptor expressed in HEK293 cells assessed as increase in cAMP production after 30 mins by HTRF assay
J Med Chem 55: 9240-54 (2012)
Article DOI: 10.1021/jm300953p
BindingDB Entry DOI: 10.7270/Q2FQ9XRB
5-hydroxytryptamine receptor 4 (5-HT4)
(Homo sapiens (Human))
BDBM50398588
(CHEMBL2179582)
Show SMILES CC1(C)C(=O)N(C(=O)NCC2CCN(CC3(O)CCOCC3)CC2)c2cc(F)ccc12
Show InChI InChI=1S/C23H32FN3O4/c1-22(2)18-4-3-17(24)13-19(18)27(20(22)28)21(29)25-14-16-5-9-26(10-6-16)15-23(30)7-11-31-12-8-23/h3-4,13,16,30H,5-12,14-15H2,1-2H3,(H,25,29)
n/an/an/an/a 1.30n/an/an/an/a
Pfizer Inc.
Curated by ChEMBL
Assay Description
Agonist activity at human 5HT4B receptor expressed in HEK293 cells assessed as increase in cAMP production after 30 mins by HTRF assay
J Med Chem 55: 9240-54 (2012)
Article DOI: 10.1021/jm300953p
BindingDB Entry DOI: 10.7270/Q2FQ9XRB