BDBM50398691 CHEMBL2178153
SMILES: CN1C(N)=N[C@]2(CN(C[C@H]2C1=O)c1ccccn1)c1cc(cs1)-c1cccc(c1)C#N
InChI Key: InChIKey=IDHCKDOPLBRJHJ-MBSDFSHPSA-N
Data: 1 KI  1 IC50
Activity Spreadsheet -- Enzyme Inhibition Constant Data from BindingDB
Found 2 hits for monomerid = 50398691
Trg + Lig
Ki
nM
ΔG°
kcal/mole
IC50
nM
Kd
nM
EC50/IC50
nM
koff
s-1
kon
M-1s-1
pHTemp
°C
Beta-secretase 1
(Homo sapiens (Human))
BDBM50398691
(CHEMBL2178153)
Show SMILES CN1C(N)=N[C@]2(CN(C[C@H]2C1=O)c1ccccn1)c1cc(cs1)-c1cccc(c1)C#N |r,c:3|
Show InChI InChI=1S/C23H20N6OS/c1-28-21(30)18-12-29(20-7-2-3-8-26-20)14-23(18,27-22(28)25)19-10-17(13-31-19)16-6-4-5-15(9-16)11-24/h2-10,13,18H,12,14H2,1H3,(H2,25,27)/t18-,23-/m0/s1
8n/an/an/an/an/an/an/an/a
Merck Research Laboratories
Curated by ChEMBL
Assay Description
Inhibition of BACE1
J Med Chem 55: 9331-45 (2012)
Article DOI: 10.1021/jm301039c
BindingDB Entry DOI: 10.7270/Q2JH3NB7
Beta-secretase 1
(Homo sapiens (Human))
BDBM50398691
(CHEMBL2178153)
Show SMILES CN1C(N)=N[C@]2(CN(C[C@H]2C1=O)c1ccccn1)c1cc(cs1)-c1cccc(c1)C#N |r,c:3|
Show InChI InChI=1S/C23H20N6OS/c1-28-21(30)18-12-29(20-7-2-3-8-26-20)14-23(18,27-22(28)25)19-10-17(13-31-19)16-6-4-5-15(9-16)11-24/h2-10,13,18H,12,14H2,1H3,(H2,25,27)/t18-,23-/m0/s1
n/an/a 50n/an/an/an/an/an/a
Merck Research Laboratories
Curated by ChEMBL
Assay Description
Inhibition of BACE1 in HEK293 cells
J Med Chem 55: 9331-45 (2012)
Article DOI: 10.1021/jm301039c
BindingDB Entry DOI: 10.7270/Q2JH3NB7