BDBM50398876 CHEMBL2178187
SMILES: COc1ccc(cc1)-c1noc(C)c1C(=O)NC(N)=NCc1cc(Cl)c(NC(=O)CS(C)(=O)=O)c(Cl)c1
InChI Key: InChIKey=KTCHVMAKPPIYNP-UHFFFAOYSA-N
Data: 1 KI  1 IC50
Activity Spreadsheet -- Enzyme Inhibition Constant Data from BindingDB
Found 2 hits for monomerid = 50398876
Trg + Lig
Ki
nM
ΔG°
kcal/mole
IC50
nM
Kd
nM
EC50/IC50
nM
koff
s-1
kon
M-1s-1
pHTemp
°C
Beta-secretase 1
(Homo sapiens (Human))
BDBM50398876
(CHEMBL2178187)
Show SMILES COc1ccc(cc1)-c1noc(C)c1C(=O)NC(N)=NCc1cc(Cl)c(NC(=O)CS(C)(=O)=O)c(Cl)c1 |w:19.21|
Show InChI InChI=1S/C23H23Cl2N5O6S/c1-12-19(20(30-36-12)14-4-6-15(35-2)7-5-14)22(32)29-23(26)27-10-13-8-16(24)21(17(25)9-13)28-18(31)11-37(3,33)34/h4-9H,10-11H2,1-3H3,(H,28,31)(H3,26,27,29,32)
30n/an/an/an/an/an/an/an/a
Bristol-Myers Squibb Research
Curated by ChEMBL
Assay Description
Displacement of [3H]BMS-599240 from BACE1 expressed in HEK293 cells
J Med Chem 55: 9208-23 (2012)
Article DOI: 10.1021/jm300931y
BindingDB Entry DOI: 10.7270/Q20G3M8M
Beta-secretase 1
(Homo sapiens (Human))
BDBM50398876
(CHEMBL2178187)
Show SMILES COc1ccc(cc1)-c1noc(C)c1C(=O)NC(N)=NCc1cc(Cl)c(NC(=O)CS(C)(=O)=O)c(Cl)c1 |w:19.21|
Show InChI InChI=1S/C23H23Cl2N5O6S/c1-12-19(20(30-36-12)14-4-6-15(35-2)7-5-14)22(32)29-23(26)27-10-13-8-16(24)21(17(25)9-13)28-18(31)11-37(3,33)34/h4-9H,10-11H2,1-3H3,(H,28,31)(H3,26,27,29,32)
n/an/a 1.90E+3n/an/an/an/an/an/a
Bristol-Myers Squibb Research
Curated by ChEMBL
Assay Description
Inhibition of BACE1 in human HEK293 cells expressing APP 695 Swedish mutant assessed as inhibition of amyloid beta (1 to 40) production after overnig...
J Med Chem 55: 9208-23 (2012)
Article DOI: 10.1021/jm300931y
BindingDB Entry DOI: 10.7270/Q20G3M8M