BDBM50398922 CHEMBL2178790
SMILES: COc1ccc2CN(CCCCCCCCN(C)C34CC5CC(C)(CC(C)(C5)C3)C4)CC[C@@]34C=C[C@H](O)C[C@@H]3Oc1c24
InChI Key: InChIKey=GNEJSUKYIBOPAJ-JRXUBHRUSA-N
Data: 1 KI  1 IC50
Activity Spreadsheet -- Enzyme Inhibition Constant Data from BindingDB
Found 2 hits for monomerid = 50398922
Trg + Lig
Ki
nM
ΔG°
kcal/mole
IC50
nM
Kd
nM
EC50/IC50
nM
koff
s-1
kon
M-1s-1
pHTemp
°C
Glutamate receptor ionotropic, NMDA 2B
(Rattus norvegicus (Rat))
BDBM50398922
(CHEMBL2178790)
Show SMILES COc1ccc2CN(CCCCCCCCN(C)C34CC5CC(C)(CC(C)(C5)C3)C4)CC[C@@]34C=C[C@H](O)C[C@@H]3Oc1c24 |r,c:36,TLB:29:18:21.22.24:27,23:22:19.18.28:27,26:25:19:21.29.22,THB:29:22:19.18.28:27,28:18:21:24.25.27,28:25:21:19.18.29,24:22:19:28.25.27,24:25:19:21.29.22,16:18:21:24.25.27,16:18:21.22.24:27|
Show InChI InChI=1S/C37H56N2O3/c1-34-20-27-21-35(2,24-34)26-36(22-27,25-34)38(3)16-9-7-5-6-8-10-17-39-18-15-37-14-13-29(40)19-31(37)42-33-30(41-4)12-11-28(23-39)32(33)37/h11-14,27,29,31,40H,5-10,15-26H2,1-4H3/t27?,29-,31-,34?,35?,36?,37-/m0/s1
>1.00E+5n/an/an/an/an/an/an/an/a
Istituto Italiano di Tecnologia
Curated by ChEMBL
Assay Description
Displacement of [3H]Ifenprodil from NMDAR-2B in Sprague-Dawley rat frontal cortex homogenates after 2 hrs by liquid scintillation counting
J Med Chem 55: 9708-21 (2012)
Article DOI: 10.1021/jm3009458
BindingDB Entry DOI: 10.7270/Q2VQ33TR
Acetylcholinesterase
(Rattus norvegicus (rat))
BDBM50398922
(CHEMBL2178790)
Show SMILES COc1ccc2CN(CCCCCCCCN(C)C34CC5CC(C)(CC(C)(C5)C3)C4)CC[C@@]34C=C[C@H](O)C[C@@H]3Oc1c24 |r,c:36,TLB:29:18:21.22.24:27,23:22:19.18.28:27,26:25:19:21.29.22,THB:29:22:19.18.28:27,28:18:21:24.25.27,28:25:21:19.18.29,24:22:19:28.25.27,24:25:19:21.29.22,16:18:21:24.25.27,16:18:21.22.24:27|
Show InChI InChI=1S/C37H56N2O3/c1-34-20-27-21-35(2,24-34)26-36(22-27,25-34)38(3)16-9-7-5-6-8-10-17-39-18-15-37-14-13-29(40)19-31(37)42-33-30(41-4)12-11-28(23-39)32(33)37/h11-14,27,29,31,40H,5-10,15-26H2,1-4H3/t27?,29-,31-,34?,35?,36?,37-/m0/s1
n/an/a 0.520n/an/an/an/an/an/a
Istituto Italiano di Tecnologia
Curated by ChEMBL
Assay Description
Inhibition of AChE in Wistar rat brain homogenates using acetylthiocholine iodide and DTNB as substrate after 10 mins by Ellman method
J Med Chem 55: 9708-21 (2012)
Article DOI: 10.1021/jm3009458
BindingDB Entry DOI: 10.7270/Q2VQ33TR