BDBM50398935 PROPYLPYRAZOLETRIOL
SMILES: CCCc1c(nn(c1-c1ccc(O)cc1)-c1ccc(O)cc1)-c1ccc(O)cc1
InChI Key: InChIKey=IOTXSIGGFRQYKW-UHFFFAOYSA-N
Data: 3 EC50
Activity Spreadsheet -- Enzyme Inhibition Constant Data from BindingDB
Found 3 hits for monomerid = 50398935
Trg + Lig
Ki
nM
ΔG°
kcal/mole
IC50
nM
Kd
nM
EC50/IC50
nM
koff
s-1
kon
M-1s-1
pHTemp
°C
Estrogen receptor
(Homo sapiens (Human))
BDBM50398935
(PROPYLPYRAZOLETRIOL)
Show SMILES CCCc1c(nn(c1-c1ccc(O)cc1)-c1ccc(O)cc1)-c1ccc(O)cc1
Show InChI InChI=1S/C24H22N2O3/c1-2-3-22-23(16-4-10-19(27)11-5-16)25-26(18-8-14-21(29)15-9-18)24(22)17-6-12-20(28)13-7-17/h4-15,27-29H,2-3H2,1H3
n/an/an/an/a 3n/an/an/an/a
Freie Universit£t Berlin
Curated by ChEMBL
Assay Description
Activation of ERalpha in human MCF7/2a cells by luciferase reporter gene assay relative to untreated control
J Med Chem 55: 9607-18 (2012)
Article DOI: 10.1021/jm300860j
BindingDB Entry DOI: 10.7270/Q2R212H2
Estrogen receptor
(Homo sapiens (Human))
BDBM50398935
(PROPYLPYRAZOLETRIOL)
Show SMILES CCCc1c(nn(c1-c1ccc(O)cc1)-c1ccc(O)cc1)-c1ccc(O)cc1
Show InChI InChI=1S/C24H22N2O3/c1-2-3-22-23(16-4-10-19(27)11-5-16)25-26(18-8-14-21(29)15-9-18)24(22)17-6-12-20(28)13-7-17/h4-15,27-29H,2-3H2,1H3
n/an/an/an/a 1n/an/an/an/a
TBA
Curated by ChEMBL
Assay Description
Estrogenic activity at ERalpha in human Ishikawa cells assessed as induction of alkaline phosphatase activity using p-nitrophenol as substrate treate...
J Nat Prod 81: 966-975 (2018)
Article DOI: 10.1021/acs.jnatprod.7b01070
BindingDB Entry DOI: 10.7270/Q2DV1NKT
Estrogen receptor
(Homo sapiens (Human))
BDBM50398935
(PROPYLPYRAZOLETRIOL)
Show SMILES CCCc1c(nn(c1-c1ccc(O)cc1)-c1ccc(O)cc1)-c1ccc(O)cc1
Show InChI InChI=1S/C24H22N2O3/c1-2-3-22-23(16-4-10-19(27)11-5-16)25-26(18-8-14-21(29)15-9-18)24(22)17-6-12-20(28)13-7-17/h4-15,27-29H,2-3H2,1H3
n/an/an/an/a 0.100n/an/an/an/a
Freie Universit£t Berlin
Curated by ChEMBL
Assay Description
Activation of human ERalpha expressed in human U2-OS cells by luciferase reporter gene assay relative to untreated control
J Med Chem 55: 9607-18 (2012)
Article DOI: 10.1021/jm300860j
BindingDB Entry DOI: 10.7270/Q2R212H2