BDBM50399199 CHEMBL2180150
SMILES: Oc1ccccc1NC(=O)N1CCOCC1
InChI Key: InChIKey=HRHSIKWMPATFLH-UHFFFAOYSA-N
Data: 1 IC50
Activity Spreadsheet -- Enzyme Inhibition Constant Data from BindingDB
Found 1 hit for monomerid = 50399199
Trg + Lig
Ki
nM
ΔG°
kcal/mole
IC50
nM
Kd
nM
EC50/IC50
nM
koff
s-1
kon
M-1s-1
pHTemp
°C
P2X purinoceptor 4
(Homo sapiens (Human))
BDBM50399199
(CHEMBL2180150)
Show SMILES Oc1ccccc1NC(=O)N1CCOCC1
Show InChI InChI=1S/C11H14N2O3/c14-10-4-2-1-3-9(10)12-11(15)13-5-7-16-8-6-13/h1-4,14H,5-8H2,(H,12,15)
n/an/a>1.00E+4n/an/an/an/an/an/a
University of Bonn
Curated by ChEMBL
Assay Description
Antagonist activity at human P2X4 receptor expressed in 1321N1 cells assessed as inhibition of ATP-induced cytosolic calcium influx compound preincub...
J Med Chem 55: 9576-88 (2012)
Article DOI: 10.1021/jm300845v
BindingDB Entry DOI: 10.7270/Q2XK8GPN