BDBM50399310 CHEMBL2180854
SMILES: Brc1ccnc(NC(=O)Nc2cccc3C(=O)N4CCCCC4c23)c1
InChI Key: InChIKey=GFPGWHOCRYTVLL-UHFFFAOYSA-N
Data: 4 IC50
Activity Spreadsheet -- Enzyme Inhibition Constant Data from BindingDB
Found 4 hits for monomerid = 50399310
Trg + Lig
Ki
nM
ΔG°
kcal/mole
IC50
nM
Kd
nM
EC50/IC50
nM
koff
s-1
kon
M-1s-1
pHTemp
°C
Cyclin-Dependent Kinase 5 (CDK5)
(Homo sapiens (Human))
BDBM50399310
(CHEMBL2180854)
Show SMILES Brc1ccnc(NC(=O)Nc2cccc3C(=O)N4CCCCC4c23)c1
Show InChI InChI=1S/C18H17BrN4O2/c19-11-7-8-20-15(10-11)22-18(25)21-13-5-3-4-12-16(13)14-6-1-2-9-23(14)17(12)24/h3-5,7-8,10,14H,1-2,6,9H2,(H2,20,21,22,25)
NCI pathway
Reactome pathway
n/an/a 25n/an/an/an/an/an/a
Universit£ d'Orl£ans
Curated by ChEMBL
Assay Description
Inhibition of human recombinant CDK5/p25 using histone H1 as substrate and [gamma-33P]-ATP after 30 mins by scintillation counting
J Med Chem 55: 9589-606 (2012)
Article DOI: 10.1021/jm3008536
BindingDB Entry DOI: 10.7270/Q28S4R2J
Glycogen synthase kinase-3
(Sus scrofa)
BDBM50399310
(CHEMBL2180854)
Show SMILES Brc1ccnc(NC(=O)Nc2cccc3C(=O)N4CCCCC4c23)c1
Show InChI InChI=1S/C18H17BrN4O2/c19-11-7-8-20-15(10-11)22-18(25)21-13-5-3-4-12-16(13)14-6-1-2-9-23(14)17(12)24/h3-5,7-8,10,14H,1-2,6,9H2,(H2,20,21,22,25)
n/an/a 22n/an/an/an/an/an/a
CNRS
Curated by ChEMBL
Assay Description
Inhibition of native porcine brain GSK-3alpha/beta using GS-1 as substrate incubated for 30 mins in presence of [gamma-33P]ATP by liquid scintillatio...
Eur J Med Chem 168: 58-77 (2019)
Article DOI: 10.1016/j.ejmech.2018.12.063
Cyclin-Dependent Kinase 5 (CDK5)
(Homo sapiens (Human))
BDBM50399310
(CHEMBL2180854)
Show SMILES Brc1ccnc(NC(=O)Nc2cccc3C(=O)N4CCCCC4c23)c1
Show InChI InChI=1S/C18H17BrN4O2/c19-11-7-8-20-15(10-11)22-18(25)21-13-5-3-4-12-16(13)14-6-1-2-9-23(14)17(12)24/h3-5,7-8,10,14H,1-2,6,9H2,(H2,20,21,22,25)
NCI pathway
Reactome pathway
n/an/a 25n/an/an/an/an/an/a
CNRS
Curated by ChEMBL
Assay Description
Inhibition of human recombinant CDK5/p25 using histone H1 as substrate in presence of [gamma-33P]ATP incubated for 30 mins by liquid scintillation co...
Eur J Med Chem 168: 58-77 (2019)
Article DOI: 10.1016/j.ejmech.2018.12.063
Dual-specificity tyrosine-phosphorylation regulated kinase 1A
(Homo sapiens (Human))
BDBM50399310
(CHEMBL2180854)
Show SMILES Brc1ccnc(NC(=O)Nc2cccc3C(=O)N4CCCCC4c23)c1
Show InChI InChI=1S/C18H17BrN4O2/c19-11-7-8-20-15(10-11)22-18(25)21-13-5-3-4-12-16(13)14-6-1-2-9-23(14)17(12)24/h3-5,7-8,10,14H,1-2,6,9H2,(H2,20,21,22,25)
Reactome pathway
n/an/a 7.60E+3n/an/an/an/an/an/a
Universit£ d'Orl£ans
Curated by ChEMBL
Assay Description
Inhibition of human recombinant GST-fused DYRK1A expressed in Escherichia coli using KKISGRLSPIMTEQ as substrate and [gamma-33P]-ATP after 30 mins by...
J Med Chem 55: 9589-606 (2012)
Article DOI: 10.1021/jm3008536
BindingDB Entry DOI: 10.7270/Q28S4R2J